{"text_format":"1","workbook":"xlsx","n_sheets":6,"sheets":["Guide","Input","Event Data Set","Individual Points","Score Sheets","Tables"],"not_rendered":{"charts":0,"images":6,"macros":1,"external_links":0,"defined_names":26,"comments":1,"pivot_tables":0},"unopened":[],"bounds":{"document_bytes":16777216,"sheet_cells":100000,"rows_first":2000,"rows_last":500,"rows_between":2000,"halvings":0,"cell_chars":16384,"cell_head_chars":4096},"cells_cut":0,"cells_raw":0,"read":"whole","date_system":"1900"}

{"sheet":"Guide","index":0,"n_rows":60,"n_cols":7,"rows_kept":60,"cut":false,"hidden":false,"merged":[[1,6,4,11],[7,1,8,9],[15,1,18,9],[19,1,20,9],[21,1,23,9],[35,1,37,10],[40,1,41,10],[42,1,43,10],[45,1,46,9],[50,1,53,9],[54,1,54,9],[55,1,56,9]]}
[]
[null,null,null,null,null,null,"   Guide"]
[]
[]
[]
[]
{"$rows_left_out":55}
{"sheet":"Input","index":1,"n_rows":811,"n_cols":38,"rows_kept":811,"cut":false,"hidden":false,"merged":[[1,16,1,22],[2,9,4,14],[2,16,2,18],[2,19,2,20],[2,21,2,22],[3,16,4,18],[3,19,4,20],[3,21,4,22],[5,16,5,22],[6,10,6,11],[6,16,6,17]]}
[]
[null,null,null,null,null,null,null,null,null,null,null,null,null,null,null,null,"Virtual Competition Team Score"]
[null,null,null,null,null,null,null,null,null,"Virtual Competition Results",null,null,null,null,null,null,"Mixed",null,null,"Girls",null,"Boys"]
[null,null,null,null,null,null,null,null,null,null,null,null,null,null,null,null,{"$f":"IF($C52=\"P\",'Individual Points'!BL56,\" \")","v":2330.0052700000001},null,null,{"$f":"IF($C52=\"S\",'Individual Points'!BR54,\" \")","v":" "},null,{"$f":"IF($C52=\"S\",'Individual Points'!BG54,\" \")","v":" "}]
[]
[null,null,null,"Awards Performance  "]
{"$rows_left_out":806}
{"sheet":"Event Data Set","index":2,"n_rows":2405,"n_cols":16,"rows_kept":2405,"cut":false,"hidden":true,"merged":[]}
["points1 Sec",null,null,null,null,"award2 Sec",null,null,null,null,null,"award12 Pri"]
[]
["Balance Test-0",0,null,null,null,"Girls Pent","Boys Pent","Girls Dec","Boys Dec",null,null,null,"Girls Pent","Boys Pent","Girls Dec","Boys Dec"]
["Balance Test-1",1,null,null,0,"Step 1","Step 1","Step 1","Step 1",null,null,0,"Step 1","Step 1","Step 1","Step 1"]
["Balance Test-2",2,null,null,1,"Step 1","Step 1","Step 1","Step 1",null,null,1,"Step 1","Step 1","Step 1","Step 1"]
["Balance Test-3",3,null,null,2,"Step 1","Step 1","Step 1","Step 1",null,null,2,"Step 1","Step 1","Step 1","Step 1"]
{"$rows_left_out":2400}
{"sheet":"Individual Points","index":3,"n_rows":56,"n_cols":132,"rows_kept":56,"cut":false,"hidden":false,"merged":[[1,9,3,14]]}
[]
[null,null,null,null,null,null,null,null,null,"Individual Points"]
[]
[null,null,null,null,null,null,null,null,null,null,null,null,null,null,null,null,null,null,null,null,null,null,null,null,null,null,null,null,null,null,null,null,null,null,null,null,null,null,null,null,null,null,null,null,null,null,null,null,null,null,null,null,null,null,null,null,null,null,null,null,"Top 5 Ranking Per Athlete - Boys",null,null,null,null,null,null,null,null,null,null,"Top 5 Ranking Per Athlete - Girls"]
[]
[null,null," Name"," Team"," Year Group"," Age"," Boy or Girl"," Balance Test"," St. Long Jump"," Speed Bounce"," Target Throw"," Overhead Heave"," Hi-Stepper"," Chest Push"," Vertical Jump"," Shuttle Run"," Javelin Throw"," Shot"," St. Triple Jump"," Pentathlon Score"," Pentathlon Award"," Decathlon Score"," Decathlon Award"," Overall Points",null,null,"Balance Test","Standing Long Jump","Speed Bounce","Target Throw","Overhead Heave","Either/Or","Hi-Stepper","Chest Push","Vertical Jump","Shuttle Run","Javelin Throw","Shot","Either/Or","Standing Triple Jump","Adapted Pentathlon Count","Adapted Pentathlon Score","Adapted Pentathlon Award",null,"Decathlon Score","Decathlon Award",null,"Balance Test","Standing Long Jump","Speed Bounce","Either/Or","Hi-Stepper","Chest Push","Vertical Jump","Shuttle Run","Either/Or","Standing Triple Jump",null,"Balance Test","Standing Long Jump","Speed Bounce","Either/Or","Hi-Stepper","Chest Push","Vertical Jump","Shuttle Run","Either/Or","Standing Triple Jump",null,"Balance Test","Standing Long Jump","Speed Bounce","Either/Or","Hi-Stepper","Chest Push","Vertical Jump","Shuttle Run","Either/Or","Standing Triple Jump",null,"Balance Test","Standing Long Jump","Speed Bounce","Either/Or","Hi-Stepper","Chest Push","Vertical Jump","Shuttle Run","Either/Or","Standing Triple Jump",null,"Balance Test","Standing Long Jump","Speed Bounce","Either/Or","Hi-Stepper","Chest Push","Vertical Jump","Shuttle Run","Either/Or","Standing Triple Jump",null,null,null,null,null,null,null,null,null,null,"Balance Test","Standing Long Jump","Speed Bounce","Either/Or","Hi-Stepper","Chest Push","Vertical Jump","Shuttle Run","Either/Or","Standing Triple Jump",null,"Balance Test","Standing Long Jump","Speed Bounce","Either/Or","Hi-Stepper","Chest Push","Vertical Jump","Shuttle Run","Either/Or","Standing Triple Jump"]
{"$rows_left_out":51}
{"sheet":"Score Sheets","index":4,"n_rows":36,"n_cols":23,"rows_kept":36,"cut":false,"hidden":false,"merged":[[5,2,5,10],[5,11,5,14],[5,22,6,22],[5,23,6,23],[5,24,6,24],[5,25,6,25],[5,26,6,26],[5,27,6,27],[5,28,6,28],[5,29,6,29],[5,30,6,30],[5,31,6,31],[7,29,8,29],[7,30,8,30],[7,31,8,31],[5,32,6,32],[6,1,6,10],[6,11,6,14],[7,1,7,2],[7,3,7,16],[7,19,15,19],[7,22,8,22],[9,22,10,22],[9,23,10,23],[7,26,8,26],[7,27,8,27],[7,28,8,28],[7,23,8,23],[7,24,8,24],[7,25,8,25],[9,27,10,27],[9,29,10,29],[7,32,8,32],[8,1,8,2],[8,3,8,14],[9,1,10,2],[9,3,9,5],[9,6,9,8],[9,9,9,11],[9,30,10,30],[9,12,9,14],[9,31,10,31],[9,32,10,32],[10,3,10,5],[10,6,10,8],[10,9,10,11],[10,12,10,14],[9,24,10,24],[9,25,10,25],[9,26,10,26],[9,28,10,28],[11,28,12,28],[11,29,12,29],[11,1,12,2],[11,3,11,6],[11,7,11,10],[11,11,11,14],[11,22,12,22],[11,23,12,23],[11,30,12,30],[11,31,12,31],[11,32,12,32],[12,3,12,6],[12,7,12,10],[12,11,12,14],[11,24,12,24],[11,25,12,25],[11,26,12,26],[11,27,12,27],[13,9,13,10],[13,11,13,12],[14,3,14,4],[14,5,14,6],[14,7,14,8],[14,9,14,10],[14,11,14,12],[13,22,14,22],[13,23,14,23],[13,24,14,24],[13,25,14,25],[13,26,14,26],[14,13,14,14],[13,27,14,27],[13,28,14,28],[13,29,14,29],[13,30,14,30],[13,31,14,31],[13,32,14,32],[15,1,16,2],[15,3,15,5],[15,6,15,8],[15,9,15,11],[15,12,15,14],[13,1,14,2],[13,3,13,4],[13,5,13,6],[13,13,13,14],[13,7,13,8],[15,31,16,31],[15,32,16,32],[16,3,16,5],[16,6,16,8],[16,9,16,11],[16,12,16,14],[16,19,24,19],[15,22,16,22],[15,23,16,23],[15,24,16,24],[19,3,19,8],[19,9,19,14],[19,22,20,22],[15,28,16,28],[15,29,16,29],[15,30,16,30],[15,25,16,25],[15,26,16,26],[15,27,16,27],[17,26,18,26],[17,27,18,27],[17,28,18,28],[16,20,24,20],[17,1,18,2],[17,3,17,6],[17,7,17,10],[17,11,17,14],[17,22,18,22],[19,1,20,2],[18,3,18,6],[18,7,18,10],[18,11,18,14],[17,23,18,23],[17,24,18,24],[17,25,18,25],[19,27,20,27],[20,3,20,8],[20,9,20,14],[19,23,20,23],[19,24,20,24],[19,28,20,28],[17,29,18,29],[17,30,18,30],[17,31,18,31],[17,32,18,32],[19,29,20,29],[19,30,20,30],[19,31,20,31],[19,32,20,32],[19,25,20,25],[19,26,20,26],[21,28,22,28],[21,29,22,29],[21,1,22,2],[21,3,21,6],[21,7,21,10],[21,11,21,14],[21,22,22,22],[21,23,22,23],[21,30,22,30],[21,31,22,31],[21,32,22,32],[22,3,22,6],[22,7,22,10],[22,11,22,14],[21,24,22,24],[21,25,22,25],[21,26,22,26],[21,27,22,27],[23,28,24,28],[23,29,24,29],[23,1,24,2],[23,3,23,6],[23,7,23,10],[23,11,23,14],[23,22,24,22],[23,23,24,23],[23,30,24,30],[23,31,24,31],[23,32,24,32],[24,3,24,6],[24,7,24,10],[24,11,24,14],[23,24,24,24],[23,25,24,25],[23,26,24,26],[23,27,24,27],[25,1,26,2],[25,3,26,14],[25,22,27,22],[25,23,27,23],[25,24,27,24],[25,25,27,25],[25,26,27,26],[25,27,27,27],[25,28,27,28],[25,29,27,29],[25,30,27,30],[25,31,27,31],[28,29,30,29],[25,32,27,32],[27,1,28,2],[27,3,27,6],[27,7,27,10],[27,11,27,14],[28,3,28,6],[28,7,28,10],[28,11,28,14],[28,22,30,22],[30,11,30,14],[28,24,30,24],[28,25,30,25],[28,26,30,26],[28,27,30,27],[28,28,30,28],[28,23,30,23],[33,1,33,2],[28,30,30,30],[28,31,30,31],[28,32,30,32],[29,1,30,2],[29,3,29,6],[29,7,29,10],[29,11,29,14],[30,3,30,6],[30,7,30,10],[31,26,36,26],[31,27,36,27],[31,28,36,28],[31,29,36,29],[31,1,32,2],[31,3,31,6],[31,7,31,10],[31,11,31,14],[31,22,36,22],[31,23,36,23],[31,30,36,30],[31,31,36,31],[31,32,36,32],[32,3,32,6],[32,7,32,10],[32,11,32,14],[33,3,33,14],[35,1,37,16],[31,24,36,24],[31,25,36,25]]}
[]
[]
[]
[]
[]
[null,"NAME",null,null,null,null,null,null,null,null,null,"AGE",null,null,null,"GIRL",null,null,null,null,null,null,"STANDING TRIPLE JUMP"]
{"$rows_left_out":31}
{"sheet":"Tables","index":5,"n_rows":93,"n_cols":25,"rows_kept":93,"cut":false,"hidden":false,"merged":[[1,8,3,12],[6,1,6,14],[7,0,8,0],[7,1,8,1],[7,2,8,2],[7,3,8,3],[7,4,8,4],[7,5,8,5],[7,6,8,6],[7,7,8,7],[7,14,8,14],[7,17,7,19],[7,24,7,28],[9,1,9,14],[7,8,8,8],[7,9,8,9],[7,10,8,10],[7,11,8,11],[7,12,8,12],[7,13,8,13]]}
[]
[null,null,null,null,null,null,null,null,"Tables"]
[]
[]
[]
[]
{"$rows_left_out":87}