{"text_format":"1","workbook":"xlsx","n_sheets":6,"sheets":["Guide","Input","Event Data Set","Individual Points","Score Sheets","Tables"],"not_rendered":{"charts":0,"images":6,"macros":1,"external_links":0,"defined_names":26,"comments":1,"pivot_tables":0},"unopened":[],"bounds":{"document_bytes":16777216,"sheet_cells":100000,"rows_first":2000,"rows_last":500,"rows_between":2000,"halvings":0,"cell_chars":16384,"cell_head_chars":4096},"cells_cut":0,"cells_raw":0,"read":"whole","date_system":"1900"}

{"sheet":"Guide","index":0,"n_rows":60,"n_cols":7,"rows_kept":60,"cut":false,"hidden":false,"merged":[[1,6,4,11],[7,1,8,9],[15,1,18,9],[19,1,20,9],[21,1,23,9],[35,1,37,10],[40,1,41,10],[42,1,43,10],[45,1,46,9],[50,1,53,9],[54,1,54,9],[55,1,56,9]]}
[]
[null,null,null,null,null,null,"   Guide"]
[]
[]
[]
[]
[null,"Class File "]
[null,"This spreadsheet provides the teacher, coach or leader with all the tools to:                                                               "]
[]
[null,"1. Calculate point scores for each event and return Sportshall Pentathlon and Decathlon Award Levels.                                                                                                                                                "]
[null,"2. Calculate Sportshall Awards Team score for use in Virtual Competitions."]
[]
[null,"Information on each section is detailed below. "]
[]
[null,"Input"]
[null,"This is the most important page - scores for each event are entered here. Please read the comments at the top of each column (denoted by a red triangle) before entering any data. If data is entered incorrectly, perhaps in the wrong format, some or all of the spreadsheet functionality may be lost.  PLEASE AVOID CUTTING AND PASTING WITHIN THIS DOCUMENT."]
[]
[]
[]
[null,"Any number of events can be entered with an Individuals Pentathlon Award formed from the accumulation of the top 5 points scores. "]
[]
[null,"Overhead Heave and Shot are presented as alternatives (to Target Throw and Javelin Throw respectively) for the Secondary Age Group. Primary Year groups should not complete these events."]
[]
[]
[]
[null,"Individual Points"]
[null,"Individual points and Award Levels are displayed here. "]
[]
[null,"Scoresheets"]
[null,"Blank Scoresheets to be printed out."]
[]
[null,"Tables"]
[null,"Provides the Points and Awards Tables in order to score manually / remotely."]
[]
[null,"Virtual Competition"]
[null,"Virtual competition provides schools with the opportunity to compete against other schools either locally or Nationally within their own school setting. To take part in the National competition please send your results to your Regional Development Officer:"]
[]
[]
[null,"http://www.sportshall.org/VTL/Contact_Us.aspx"]
[]
[null,"Primary Virtual competition scores are based on the Top 25 Event points scores recorded by Boys in addition to the Top 25 Event points scores recorded by Girls to create a Mixed score."]
[]
[null,"The Secondary Virtual competition is scored in the same manner although seperate Boys and Girls scores are provided."]
[]
[]
[null,"The Sportshall Team welcome comments on all aspects of its work. Please contact us via email for equipment, badges and certificates, visit: "]
[]
[null,"team@sportshall.org"]
[null,"www.eveque.co.uk"]
[]
[null,"Please email your completed spreadsheet to your Regional Sportshall Development Officer for inclusion in the National Virtual League and Free Certificates (whilst stocks last)."]
[]
[]
[]
[null,"Sportshall Contacts"]
[null,"Please include in your email the name/s of the school/s, the town and region and we will upload the result and League standing to the Sportshall website."]
[]
[]
[]
[null,290713]

{"sheet":"Input","index":1,"n_rows":811,"n_cols":38,"rows_kept":811,"cut":false,"hidden":false,"merged":[[1,16,1,22],[2,9,4,14],[2,16,2,18],[2,19,2,20],[2,21,2,22],[3,16,4,18],[3,19,4,20],[3,21,4,22],[5,16,5,22],[6,10,6,11],[6,16,6,17]]}
[]
[null,null,null,null,null,null,null,null,null,null,null,null,null,null,null,null,"Virtual Competition Team Score"]
[null,null,null,null,null,null,null,null,null,"Virtual Competition Results",null,null,null,null,null,null,"Mixed",null,null,"Girls",null,"Boys"]
[null,null,null,null,null,null,null,null,null,null,null,null,null,null,null,null,{"$f":"IF($C52=\"P\",'Individual Points'!BL56,\" \")","v":2330.0052700000001},null,null,{"$f":"IF($C52=\"S\",'Individual Points'!BR54,\" \")","v":" "},null,{"$f":"IF($C52=\"S\",'Individual Points'!BG54,\" \")","v":" "}]
[]
[null,null,null,"Awards Performance  "]
[null,null,null,null,null,null,null,null,null,null,"Either / Or",null,null,null,null,null,"Either / Or"]
[null,null,null," Name"," Year Group"," Age"," Boy or Girl"," Balance Test"," St. Long Jump"," Speed Bounce"," Target Throw"," Overhead Heave"," Hi-Stepper"," Chest Push"," Vertical Jump"," Shuttle Run"," Javelin Throw"," Shot"," St. Triple Jump"," Pentathlon Score"," Pentathlon Award"," Decathlon Score"," Decathlon Award"]
[null,null,null,null,null,null,"Boy"]
[null,null,null,null,null,null,"Girl"]
[null,null,{"$f":"IF(OR(E11=\" \",E11=0),\" \",IF(E11<12,E11,VLOOKUP(E11,SCOT,2,)))","v":6},"Nathan Cant",6,10,"BOY",34,1.62,33,14,null,17.7,null,null,null,null,null,null,{"$f":"'Individual Points'!T7","v":173},{"$f":"'Individual Points'!U7","v":"Step 10"},{"$f":"'Individual Points'!V7","v":" "},{"$f":"'Individual Points'!W7","v":" "},{"$f":"IF(OR(K11>0,L11>0),1,\" \")","v":1},{"$f":"IF(OR(Q11>0,R11>0),1,\" \")","v":" "}]
[null,null,5,"Hollie Scott",5,10,"GIRL",39,1.44,29,7,null,21.1,null,null,null,null,null,null,{"$f":"'Individual Points'!T8","v":133},{"$f":"'Individual Points'!U8","v":"Step 7"},{"$f":"'Individual Points'!V8","v":" "},{"$f":"'Individual Points'!W8","v":" "},1," ",null,10.1,0.25,"Boy",3,null,1,null,"1-1","P",null,"P1",1]
[null,null,4,"Katie Keane",4,9,"GIRL",30,1.06,19,10,null,23.1,null,null,null,null,null,null,{"$f":"'Individual Points'!T9","v":102},{"$f":"'Individual Points'!U9","v":"Step 5"},{"$f":"'Individual Points'!V9","v":" "},{"$f":"'Individual Points'!W9","v":" "},1," ",null,10.199999999999999,0.5,"Girl",4,null,2,null,"2-1","P",null,"P2",2]
[null,null,5,"Sophie Ford",5,9,"GIRL",60,1.38,26,17,null,21.7,null,null,null,null,null,null,{"$f":"'Individual Points'!T10","v":179},{"$f":"'Individual Points'!U10","v":"Bronze"},{"$f":"'Individual Points'!V10","v":" "},{"$f":"'Individual Points'!W10","v":" "},1," ",null,10.3,0.75,null,5,null,3,null,"3-1","P",null,"P3",3]
[null,null,6,"Katie Killick",6,10,"GIRL",60,1.72,38,8,null,17.7,null,null,null,null,null,null,{"$f":"'Individual Points'!T11","v":196},{"$f":"'Individual Points'!U11","v":"Bronze"},{"$f":"'Individual Points'!V11","v":" "},{"$f":"'Individual Points'!W11","v":" "},1," ",null,10.4,1,null,6,null,4,null,"4-1","P",null,"P4",4]
[null,null,2,"Bradley Cant",2,7,"BOY",31,1.42,23,6,null,19.5,null,null,null,null,null,null,{"$f":"'Individual Points'!T12","v":115},{"$f":"'Individual Points'!U12","v":"Step 6"},{"$f":"'Individual Points'!V12","v":" "},{"$f":"'Individual Points'!W12","v":" "},1," ",null,10.5,1.25,null,7,null,5,null,"5-1","P",null,"P5",5]
[null,null,5,"Thaila Jade-Mason",5,10,"GIRL",51,1.8,32,11,null,16.8,null,null,null,null,null,null,{"$f":"'Individual Points'!T13","v":199},{"$f":"'Individual Points'!U13","v":"Bronze"},{"$f":"'Individual Points'!V13","v":" "},{"$f":"'Individual Points'!W13","v":" "},1," ",null,10.6,1.5,null,8,null,6,null,"6-1","P",null,"P6",6]
[null,null,5,"Grace Smith",5,9,"GIRL",59,1.6,34,13,null,18.8,null,null,null,null,null,null,{"$f":"'Individual Points'!T14","v":197},{"$f":"'Individual Points'!U14","v":"Bronze"},{"$f":"'Individual Points'!V14","v":" "},{"$f":"'Individual Points'!W14","v":" "},1," ",null,10.7,1.75,null,9,null,7,null,"7-1","P",null,"P7",6]
[null,null,6,"Logan Dewar",6,10,"BOY",39,1.42,33,19,null,15.9,null,null,null,null,null,null,{"$f":"'Individual Points'!T15","v":194},{"$f":"'Individual Points'!U15","v":"Bronze"},{"$f":"'Individual Points'!V15","v":" "},{"$f":"'Individual Points'!W15","v":" "},1," ",null,10.8,2,null,10,null,8,null,"8-1","P",null,"S1",8]
[null,null,6,"Ash Carter",6,10,"BOY",57,1.46,36,12,null,14.5,null,null,null,null,null,null,{"$f":"'Individual Points'!T16","v":212},{"$f":"'Individual Points'!U16","v":"Bronze"},{"$f":"'Individual Points'!V16","v":" "},{"$f":"'Individual Points'!W16","v":" "},1," ",null,10.9,2.25,null,11,null,9,null,"9-1","P",null,"S2",9]
[null,null,6,"Archie Wright",6,10,"BOY",24,1.52,30,9,null,17.2,null,null,null,null,null,null,{"$f":"'Individual Points'!T17","v":139},{"$f":"'Individual Points'!U17","v":"Step 7"},{"$f":"'Individual Points'!V17","v":" "},{"$f":"'Individual Points'!W17","v":" "},1," ",null,11,2.5,null,12,null,10,null,"10-1","P",null,"S3",10]
[null,null,7,"Charlotte Keane",7,11,"GIRL",60,1.62,35,null,null,17,5.25,null,null,null,null,null,{"$f":"'Individual Points'!T18","v":204},{"$f":"'Individual Points'!U18","v":"Step 10"},{"$f":"'Individual Points'!V18","v":" "},{"$f":"'Individual Points'!W18","v":" "}," "," ",null,11.1,2.75,null,13,null,11,null,"11-1","P",null,"S4",11]
[null,null,8,"Arti Mead",8,12,"BOY",51,1.52,34,null,null,15.1,5.25,null,null,null,null,null,{"$f":"'Individual Points'!T19","v":202},{"$f":"'Individual Points'!U19","v":"Step 9"},{"$f":"'Individual Points'!V19","v":" "},{"$f":"'Individual Points'!W19","v":" "}," "," ",null,11.2,3,null,14,null,null,null,"2-2","P"]
[null,null,7,"Sid Mead",7,11,"BOY",40,1.22,32,null,null,15.8,4.75,null,null,null,null,null,{"$f":"'Individual Points'!T20","v":162},{"$f":"'Individual Points'!U20","v":"Step 7"},{"$f":"'Individual Points'!V20","v":" "},{"$f":"'Individual Points'!W20","v":" "}," "," ",null,11.3,3.25,null,15,null,null,null,"3-2","P"]
[null,null,7,"Arron O'Dwyer",7,11,"BOY",60,1.82,44,null,null,15.1,5.75,null,null,null,null,null,{"$f":"'Individual Points'!T21","v":243},{"$f":"'Individual Points'!U21","v":"Bronze"},{"$f":"'Individual Points'!V21","v":" "},{"$f":"'Individual Points'!W21","v":" "}," "," ",null,11.4,3.5,null,16,null,null,null,"4-2","P"]
[null,null,5,"Emily Axen-Blackwell",5,9,"Girl",26,1.44,27,10,null,16.8,null,null,null,null,null,null,{"$f":"'Individual Points'!T22","v":138},{"$f":"'Individual Points'!U22","v":"Step 7"},{"$f":"'Individual Points'!V22","v":" "},{"$f":"'Individual Points'!W22","v":" "},1," ",null,11.5,3.75,null,17,null,null,null,"5-2","P"]
[null,null,{"$f":"IF(OR(E27=\" \",E27=0),\" \",IF(E27<12,E27,VLOOKUP(E27,SCOT,2,)))","v":4},"Alice Burhams",4,8,"Girl",26,1.46,25,2,null,18.2,null,null,null,null,null,null,{"$f":"'Individual Points'!T23","v":106},{"$f":"'Individual Points'!U23","v":"Step 5"},{"$f":"'Individual Points'!V23","v":" "},{"$f":"'Individual Points'!W23","v":" "},{"$f":"IF(OR(K27>0,L27>0),1,\" \")","v":1},{"$f":"IF(OR(Q27>0,R27>0),1,\" \")","v":" "},null,11.6,4,null,18,null,null,null,"6-2","P"]
[null,null,{"$f":"IF(OR(E28=\" \",E28=0),\" \",IF(E28<12,E28,VLOOKUP(E28,SCOT,2,)))","v":7},"Mukhtar Farah",7,11,"BOY",40,1.68,33,null,null,17.399999999999999,4.5,null,null,null,null,null,{"$f":"'Individual Points'!T24","v":174},{"$f":"'Individual Points'!U24","v":"Step 8"},{"$f":"'Individual Points'!V24","v":" "},{"$f":"'Individual Points'!W24","v":" "},{"$f":"IF(OR(K28>0,L28>0),1,\" \")","v":" "},{"$f":"IF(OR(Q28>0,R28>0),1,\" \")","v":" "},null,11.7,4.25,null,19,null,null,null,"7-2","P"]
[null,null,{"$f":"IF(OR(E29=\" \",E29=0),\" \",IF(E29<12,E29,VLOOKUP(E29,SCOT,2,)))","v":3},"Fenya Treece",3,7,"GIRL",24,1.34,16,6,null,20.7,null,null,null,null,null,null,{"$f":"'Individual Points'!T25","v":93},{"$f":"'Individual Points'!U25","v":"Step 4"},{"$f":"'Individual Points'!V25","v":" "},{"$f":"'Individual Points'!W25","v":" "},{"$f":"IF(OR(K29>0,L29>0),1,\" \")","v":1},{"$f":"IF(OR(Q29>0,R29>0),1,\" \")","v":" "},null,11.8,4.5,null,20,null,null,null,"8-2","P"]
[null,null,{"$f":"IF(OR(E30=\" \",E30=0),\" \",IF(E30<12,E30,VLOOKUP(E30,SCOT,2,)))","v":6},"Arlo Treece",6,10,"BOY",60,1.62,35,14,null,15.8,null,null,null,null,null,null,{"$f":"'Individual Points'!T26","v":220},{"$f":"'Individual Points'!U26","v":"Bronze"},{"$f":"'Individual Points'!V26","v":" "},{"$f":"'Individual Points'!W26","v":" "},{"$f":"IF(OR(K30>0,L30>0),1,\" \")","v":1},{"$f":"IF(OR(Q30>0,R30>0),1,\" \")","v":" "},null,11.9,4.75,null,21,null,null,null,"9-2","P"]
[null,null,3,"Esa Blake",3,7,"GIRL",36,1.2,16,4,null,19.100000000000001,null,null,null,null,null,null,{"$f":"'Individual Points'!T27","v":99},{"$f":"'Individual Points'!U27","v":"Step 4"},{"$f":"'Individual Points'!V27","v":" "},{"$f":"'Individual Points'!W27","v":" "},{"$f":"IF(OR(K31>0,L31>0),1,\" \")","v":1},{"$f":"IF(OR(Q31>0,R31>0),1,\" \")","v":" "},null,12,5,null,22,null,null,null,"10-2","P"]
[null,null,4,"Oran Blake",4,8,"BOY",13,1.32,22,8,null,21,null,null,null,null,null,null,{"$f":"'Individual Points'!T28","v":94},{"$f":"'Individual Points'!U28","v":"Step 4"},{"$f":"'Individual Points'!V28","v":" "},{"$f":"'Individual Points'!W28","v":" "},1," ",null,12.1,5.25,null,23,null,null,null,"11-2","P"]
[null,null,{"$f":"IF(OR(E33=\" \",E33=0),\" \",IF(E33<12,E33,VLOOKUP(E33,SCOT,2,)))","v":6},"Donncha Blake",6,10,"BOY",50,1.44,30,16,null,17.399999999999999,null,null,null,null,null,null,{"$f":"'Individual Points'!T29","v":185},{"$f":"'Individual Points'!U29","v":"Bronze"},{"$f":"'Individual Points'!V29","v":" "},{"$f":"'Individual Points'!W29","v":" "},1," ",null,12.2,5.5,null,24,null,null,null,"3-3","P"]
[null,null,8,"Teagan Blake",8,12,"GIRL",57,1.76,34,null,null,17.100000000000001,6.25,null,null,null,null,null,{"$f":"'Individual Points'!T30","v":214},{"$f":"'Individual Points'!U30","v":"Step 10"},{"$f":"'Individual Points'!V30","v":" "},{"$f":"'Individual Points'!W30","v":" "}," "," ",null,12.3,5.75,null,25,null,null,null,"4-3","P"]
[null,null,8,"Ruby Sanders",8,12,"GIRL",60,1.78,34,null,null,15.7,6,null,null,null,null,null,{"$f":"'Individual Points'!T31","v":228},{"$f":"'Individual Points'!U31","v":"Bronze"},{"$f":"'Individual Points'!V31","v":" "},{"$f":"'Individual Points'!W31","v":" "}," "," ",null,12.4,6,null,26,null,null,null,"5-3","P"]
[null,null,8,"Annabelle Deards",8,12,"GIRL",24,1.54,33,null,null,16.899999999999999,6.5,null,null,null,null,null,{"$f":"'Individual Points'!T32","v":164},{"$f":"'Individual Points'!U32","v":"Step 8"},{"$f":"'Individual Points'!V32","v":" "},{"$f":"'Individual Points'!W32","v":" "}," "," ",null,12.5,6.25,null,27,null,null,null,"6-3","P"]
[null,null,3,"William Deards",3,8,"BOY",43,1.24,19,10,null,18.100000000000001,null,null,null,null,null,null,{"$f":"'Individual Points'!T33","v":135},{"$f":"'Individual Points'!U33","v":"Step 7"},{"$f":"'Individual Points'!V33","v":" "},{"$f":"'Individual Points'!W33","v":" "},1," ",null,12.6,6.5,null,28,null,null,null,"7-3","P"]
[null,null,2,"William Blunt",2,6,"BOY",19,1.02,16,2,null,20.2,null,null,null,null,null,null,{"$f":"'Individual Points'!T34","v":69},{"$f":"'Individual Points'!U34","v":"Step 3"},{"$f":"'Individual Points'!V34","v":" "},{"$f":"'Individual Points'!W34","v":" "},1," ",null,12.7,6.75,null,29,null,null,null,"8-3","P"]
[null,null,4,"Barni Fritz",4,8,"BOY",25,1.08,17,9,null,21.6,null,null,null,null,null,null,{"$f":"'Individual Points'!T35","v":95},{"$f":"'Individual Points'!U35","v":"Step 4"},{"$f":"'Individual Points'!V35","v":" "},{"$f":"'Individual Points'!W35","v":" "},1," ",null,12.8,7,null,30,null,null,null,"9-3","P"]
[null,null,6,"Charlie Sabbitini",6,10,"BOY",38,1.26,26,3,null,19.399999999999999,null,null,null,null,null,null,{"$f":"'Individual Points'!T36","v":112},{"$f":"'Individual Points'!U36","v":"Step 5"},{"$f":"'Individual Points'!V36","v":" "},{"$f":"'Individual Points'!W36","v":" "},1," ",null,12.9,7.25,null,31,null,null,null,"10-3","P"]
[null,null,6,"Toby Evans",6,10,"BOY",58,1.52,31,18,null,17.7,null,null,null,null,null,null,{"$f":"'Individual Points'!T37","v":203},{"$f":"'Individual Points'!U37","v":"Bronze"},{"$f":"'Individual Points'!V37","v":" "},{"$f":"'Individual Points'!W37","v":" "},1," ",null,13,7.5,null,32,null,null,null,"11-3","P"]
[null,null,4,"Charlotte Evans",4,8,"GIRL",56,1.18,30,4,null,18.3,null,null,null,null,null,null,{"$f":"'Individual Points'!T38","v":142},{"$f":"'Individual Points'!U38","v":"Step 8"},{"$f":"'Individual Points'!V38","v":" "},{"$f":"'Individual Points'!W38","v":" "},1," ",null,13.1,7.75,null,33,null,null,null,"4-4","P"]
[null,null,5,"James Gibney",5,9,"BOY",50,1.36,24,9,null,21.4,null,null,null,null,null,null,{"$f":"'Individual Points'!T39","v":142},{"$f":"'Individual Points'!U39","v":"Step 7"},{"$f":"'Individual Points'!V39","v":" "},{"$f":"'Individual Points'!W39","v":" "},1," ",null,13.2,8,null,34,null,null,null,"5-4","P"]
[null,null,5,"Orlagh Brunning",5,9,"GIRL",53,1.74,30,17,null,16.399999999999999,null,null,null,null,null,null,{"$f":"'Individual Points'!T40","v":217},{"$f":"'Individual Points'!U40","v":"Bronze"},{"$f":"'Individual Points'!V40","v":" "},{"$f":"'Individual Points'!W40","v":" "},1," ",null,13.3,8.25,null,35,null,null,null,"6-4","P"]
[null,null,6,"Harriet Butlin",6,10,"GIRL",26,1.42,32,10,null,18.899999999999999,null,null,null,null,null,null,{"$f":"'Individual Points'!T41","v":134},{"$f":"'Individual Points'!U41","v":"Step 7"},{"$f":"'Individual Points'!V41","v":" "},{"$f":"'Individual Points'!W41","v":" "},1," ",null,13.4,8.5,null,36,null,null,null,"7-4","P"]
[null,null,4,"Koye Sule",4,8,"BOY",14,1.78,24,12,null,21.7,null,null,null,null,null,null,{"$f":"'Individual Points'!T42","v":135},{"$f":"'Individual Points'!U42","v":"Step 7"},{"$f":"'Individual Points'!V42","v":" "},{"$f":"'Individual Points'!W42","v":" "},{"$f":"IF(OR(K46>0,L46>0),1,\" \")","v":1},{"$f":"IF(OR(Q46>0,R46>0),1,\" \")","v":" "},null,13.5,8.75,null,37,null,null,null,"8-4","P"]
[null,null," ",null,null,null,null,null,null,null,null,null,null,null,null,null,null,null,null,{"$f":"'Individual Points'!T43","v":" "},{"$f":"'Individual Points'!U43","v":" "},{"$f":"'Individual Points'!V43","v":" "},{"$f":"'Individual Points'!W43","v":" "},{"$f":"IF(OR(K47>0,L47>0),1,\" \")","v":" "},{"$f":"IF(OR(Q47>0,R47>0),1,\" \")","v":" "},null,13.6,9,null,38,null,null,null,"9-4","P"]
[null,null," ",null,null,null,null,null,null,null,null,null,null,null,null,null,null,null,null,{"$f":"'Individual Points'!T44","v":" "},{"$f":"'Individual Points'!U44","v":" "},{"$f":"'Individual Points'!V44","v":" "},{"$f":"'Individual Points'!W44","v":" "},{"$f":"IF(OR(K48>0,L48>0),1,\" \")","v":" "},{"$f":"IF(OR(Q48>0,R48>0),1,\" \")","v":" "},null,13.7,9.25,null,39,null,null,null,"10-4","P"]
[null,null," ",null,null,null,null,null,null,null,null,null,null,null,null,null,null,null,null,{"$f":"'Individual Points'!T45","v":" "},{"$f":"'Individual Points'!U45","v":" "},{"$f":"'Individual Points'!V45","v":" "},{"$f":"'Individual Points'!W45","v":" "},{"$f":"IF(OR(K49>0,L49>0),1,\" \")","v":" "},{"$f":"IF(OR(Q49>0,R49>0),1,\" \")","v":" "},null,13.8,9.5,null,40,null,null,null,"11-4","P"]
[null,null," ",null,null,null,null,null,null,null,null,null,null,null,null,null,null,null,null,{"$f":"'Individual Points'!T46","v":" "},{"$f":"'Individual Points'!U46","v":" "},{"$f":"'Individual Points'!V46","v":" "},{"$f":"'Individual Points'!W46","v":" "}," "," ",null,13.9,9.75,null,41,null,null,null,"5-5","P"]
[null,null,{"$f":"CONCATENATE(MAX(C11:C50),\"-\",(MIN(C11:C50)))","v":"8-2"},null,null,null,null,null,null,null,null,null,null,null,null,null,null,null,null,null,null,null,null,null,null,null,14,10,null,42,null,null,null,"6-5","P"]
[null,null,{"$f":"IF(ISNA(VLOOKUP(C51,VCGROUP,2,)),\" \",(VLOOKUP(C51,VCGROUP,2,)))","v":"P"},null,null,null,null,null,null,null,null,null,null,null,null,null,null,null,null,null,null,null,null,null,null,null,14.1,10.25,null,43,null,null,null,"7-5","P"]
[null,null,null,null,null,null,null,null,null,null,null,null,null,null,null,null,null,null,null,null,null,null,null,null,null,null,14.2,10.5,null,44,null,null,null,"8-5","P"]
[null,null,null,null,null,null,null,null,null,null,null,null,null,null,null,null,null,null,null,null,null,null,null,null,null,null,14.3,10.75,null,45,null,null,null,"9-5","P"]
[null,null,null,null,null,null,null,null,null,null,null,null,null,null,null,null,null,null,null,null,null,null,null,null,null,null,14.4,11,null,46,null,null,null,"10-5","P"]
[null,null,null,null,null,null,null,null,null,null,null,null,null,null,null,null,null,null,null,null,null,null,null,null,null,null,14.5,11.25,null,47,null,null,null,"11-5","P"]
[null,null,null,null,null,null,null,null,null,null,null,null,null,null,null,null,null,null,null,null,null,null,null,null,null,null,14.6,11.5,null,48,null,null,null,"6-6","P"]
[null,null,null,null,null,null,null,null,null,null,null,null,null,null,null,null,null,null,null,null,null,null,null,null,null,null,14.7,11.75,null,49,null,null,null,"7-6","P"]
[null,null,null,null,null,null,null,null,null,null,null,null,null,null,null,null,null,null,null,null,null,null,null,null,null,null,14.8,12,null,50,null,null,null,"8-6","P"]
[null,null,null,null,null,null,null,null,null,null,null,null,null,null,null,null,null,null,null,null,null,null,null,null,null,null,14.9,12.25,null,51,null,null,null,"9-6","P"]
[null,null,null,null,null,null,null,null,null,null,null,null,null,null,null,null,null,null,null,null,null,null,null,null,null,null,15,12.5,null,52,null,null,null,"10-6","P"]
[null,null,null,null,null,null,null,null,null,null,null,null,null,null,null,null,null,null,null,null,null,null,null,null,null,null,15.1,12.75,null,53,null,null,null,"11-6","P"]
[null,null,null,null,null,null,null,null,null,null,null,null,null,null,null,null,null,null,null,null,null,null,null,null,null,null,15.2,13,null,54,null,null,null,"7-7","S"]
[null,null,null,null,null,null,null,null,null,null,null,null,null,null,null,null,null,null,null,null,null,null,null,null,null,null,15.3,13.25,null,55,null,null,null,"8-7","S"]
[null,null,null,null,null,null,null,null,null,null,null,null,null,null,null,null,null,null,null,null,null,null,null,null,null,null,15.4,13.5,null,56,null,null,null,"9-7","S"]
[null,null,null,null,null,null,null,null,null,null,null,null,null,null,null,null,null,null,null,null,null,null,null,null,null,null,15.5,13.75,null,57,null,null,null,"10-7","S"]
[null,null,null,null,null,null,null,null,null,null,null,null,null,null,null,null,null,null,null,null,null,null,null,null,null,null,15.6,14,null,58,null,null,null,"11-7","S"]
[null,null,null,null,null,null,null,null,null,null,null,null,null,null,null,null,null,null,null,null,null,null,null,null,null,null,15.7,14.25,null,59,null,null,null,"8-8","S"]
[null,null,null,null,null,null,null,null,null,null,null,null,null,null,null,null,null,null,null,null,null,null,null,null,null,null,15.8,14.5,null,60,null,null,null,"9-8","S"]
[null,null,null,null,null,null,null,null,null,null,null,null,null,null,null,null,null,null,null,null,null,null,null,null,null,null,15.9,14.75,null,61,null,null,null,"10-8","S"]
[null,null,null,null,null,null,null,null,null,null,null,null,null,null,null,null,null,null,null,null,null,null,null,null,null,null,16,15,null,62,null,null,null,"11-8","S"]
[null,null,null,null,null,null,null,null,null,null,null,null,null,null,null,null,null,null,null,null,null,null,null,null,null,null,16.100000000000001,null,null,63,null,null,null,"9-9","S"]
[null,null,null,null,null,null,null,null,null,null,null,null,null,null,null,null,null,null,null,null,null,null,null,null,null,null,16.2,null,null,64,null,null,null,"10-9","S"]
[null,null,null,null,null,null,null,null,null,null,null,null,null,null,null,null,null,null,null,null,null,null,null,null,null,null,16.3,null,null,65,null,null,null,"11-9","S"]
[null,null,null,null,null,null,null,null,null,null,null,null,null,null,null,null,null,null,null,null,null,null,null,null,null,null,16.399999999999999,null,null,66,null,null,null,"10-10","S"]
[null,null,null,null,null,null,null,null,null,null,null,null,null,null,null,null,null,null,null,null,null,null,null,null,null,null,16.5,null,null,67,null,null,null,"11-10","S"]
[null,null,null,null,null,null,null,null,null,null,null,null,null,null,null,null,null,null,null,null,null,null,null,null,null,null,16.600000000000001,null,null,68,null,null,null,"11-11","S"]
[null,null,null,null,null,null,null,null,null,null,null,null,null,null,null,null,null,null,null,null,null,null,null,null,null,null,16.7,null,null,69]
[null,null,null,null,null,null,null,null,null,null,null,null,null,null,null,null,null,null,null,null,null,null,null,null,null,null,16.8,null,null,70]
[null,null,null,null,null,null,null,null,null,null,null,null,null,null,null,null,null,null,null,null,null,null,null,null,null,null,16.899999999999999,null,null,71]
[null,null,null,null,null,null,null,null,null,null,null,null,null,null,null,null,null,null,null,null,null,null,null,null,null,null,17,null,null,72]
[null,null,null,null,null,null,null,null,null,null,null,null,null,null,null,null,null,null,null,null,null,null,null,null,null,null,17.100000000000001,null,null,73]
[null,null,null,null,null,null,null,null,null,null,null,null,null,null,null,null,null,null,null,null,null,null,null,null,null,null,17.2,null,null,74]
[null,null,null,null,null,null,null,null,null,null,null,null,null,null,null,null,null,null,null,null,null,null,null,null,null,null,17.3,null,null,75]
[null,null,null,null,null,null,null,null,null,null,null,null,null,null,null,null,null,null,null,null,null,null,null,null,null,null,17.399999999999999,null,null,76]
[null,null,null,null,null,null,null,null,null,null,null,null,null,null,null,null,null,null,null,null,null,null,null,null,null,null,17.5,null,null,77]
[null,null,null,null,null,null,null,null,null,null,null,null,null,null,null,null,null,null,null,null,null,null,null,null,null,null,17.600000000000001,null,null,78]
[null,null,null,null,null,null,null,null,null,null,null,null,null,null,null,null,null,null,null,null,null,null,null,null,null,null,17.7,null,null,79]
[null,null,null,null,null,null,null,null,null,null,null,null,null,null,null,null,null,null,null,null,null,null,null,null,null,null,17.8,null,null,80]
[null,null,null,null,null,null,null,null,null,null,null,null,null,null,null,null,null,null,null,null,null,null,null,null,null,null,17.899999999999999]
[null,null,null,null,null,null,null,null,null,null,null,null,null,null,null,null,null,null,null,null,null,null,null,null,null,null,18]
[null,null,null,null,null,null,null,null,null,null,null,null,null,null,null,null,null,null,null,null,null,null,null,null,null,null,18.100000000000001]
[null,null,null,null,null,null,null,null,null,null,null,null,null,null,null,null,null,null,null,null,null,null,null,null,null,null,18.2]
[null,null,null,null,null,null,null,null,null,null,null,null,null,null,null,null,null,null,null,null,null,null,null,null,null,null,18.3]
[null,null,null,null,null,null,null,null,null,null,null,null,null,null,null,null,null,null,null,null,null,null,null,null,null,null,18.399999999999999]
[null,null,null,null,null,null,null,null,null,null,null,null,null,null,null,null,null,null,null,null,null,null,null,null,null,null,18.5]
[null,null,null,null,null,null,null,null,null,null,null,null,null,null,null,null,null,null,null,null,null,null,null,null,null,null,18.600000000000001]
[null,null,null,null,null,null,null,null,null,null,null,null,null,null,null,null,null,null,null,null,null,null,null,null,null,null,18.7]
[null,null,null,null,null,null,null,null,null,null,null,null,null,null,null,null,null,null,null,null,null,null,null,null,null,null,18.8]
[null,null,null,null,null,null,null,null,null,null,null,null,null,null,null,null,null,null,null,null,null,null,null,null,null,null,18.899999999999999]
[null,null,null,null,null,null,null,null,null,null,null,null,null,null,null,null,null,null,null,null,null,null,null,null,null,null,19]
[null,null,null,null,null,null,null,null,null,null,null,null,null,null,null,null,null,null,null,null,null,null,null,null,null,null,19.100000000000001]
[null,null,null,null,null,null,null,null,null,null,null,null,null,null,null,null,null,null,null,null,null,null,null,null,null,null,19.2]
[null,null,null,null,null,null,null,null,null,null,null,null,null,null,null,null,null,null,null,null,null,null,null,null,null,null,19.3]
[null,null,null,null,null,null,null,null,null,null,null,null,null,null,null,null,null,null,null,null,null,null,null,null,null,null,19.399999999999999]
[null,null,null,null,null,null,null,null,null,null,null,null,null,null,null,null,null,null,null,null,null,null,null,null,null,null,19.5]
[null,null,null,null,null,null,null,null,null,null,null,null,null,null,null,null,null,null,null,null,null,null,null,null,null,null,19.600000000000001]
[null,null,null,null,null,null,null,null,null,null,null,null,null,null,null,null,null,null,null,null,null,null,null,null,null,null,19.7]
[null,null,null,null,null,null,null,null,null,null,null,null,null,null,null,null,null,null,null,null,null,null,null,null,null,null,19.8]
[null,null,null,null,null,null,null,null,null,null,null,null,null,null,null,null,null,null,null,null,null,null,null,null,null,null,19.899999999999999]
[null,null,null,null,null,null,null,null,null,null,null,null,null,null,null,null,null,null,null,null,null,null,null,null,null,null,20]
[null,null,null,null,null,null,null,null,null,null,null,null,null,null,null,null,null,null,null,null,null,null,null,null,null,null,20.100000000000001]
[null,null,null,null,null,null,null,null,null,null,null,null,null,null,null,null,null,null,null,null,null,null,null,null,null,null,20.2]
[null,null,null,null,null,null,null,null,null,null,null,null,null,null,null,null,null,null,null,null,null,null,null,null,null,null,20.3]
[null,null,null,null,null,null,null,null,null,null,null,null,null,null,null,null,null,null,null,null,null,null,null,null,null,null,20.399999999999999]
[null,null,null,null,null,null,null,null,null,null,null,null,null,null,null,null,null,null,null,null,null,null,null,null,null,null,20.5]
[null,null,null,null,null,null,null,null,null,null,null,null,null,null,null,null,null,null,null,null,null,null,null,null,null,null,20.6]
[null,null,null,null,null,null,null,null,null,null,null,null,null,null,null,null,null,null,null,null,null,null,null,null,null,null,20.7]
[null,null,null,null,null,null,null,null,null,null,null,null,null,null,null,null,null,null,null,null,null,null,null,null,null,null,20.8]
[null,null,null,null,null,null,null,null,null,null,null,null,null,null,null,null,null,null,null,null,null,null,null,null,null,null,20.9]
[null,null,null,null,null,null,null,null,null,null,null,null,null,null,null,null,null,null,null,null,null,null,null,null,null,null,21]
[null,null,null,null,null,null,null,null,null,null,null,null,null,null,null,null,null,null,null,null,null,null,null,null,null,null,21.1]
[null,null,null,null,null,null,null,null,null,null,null,null,null,null,null,null,null,null,null,null,null,null,null,null,null,null,21.2]
[null,null,null,null,null,null,null,null,null,null,null,null,null,null,null,null,null,null,null,null,null,null,null,null,null,null,21.3]
[null,null,null,null,null,null,null,null,null,null,null,null,null,null,null,null,null,null,null,null,null,null,null,null,null,null,21.4]
[null,null,null,null,null,null,null,null,null,null,null,null,null,null,null,null,null,null,null,null,null,null,null,null,null,null,21.5]
[null,null,null,null,null,null,null,null,null,null,null,null,null,null,null,null,null,null,null,null,null,null,null,null,null,null,21.6]
[null,null,null,null,null,null,null,null,null,null,null,null,null,null,null,null,null,null,null,null,null,null,null,null,null,null,21.7]
[null,null,null,null,null,null,null,null,null,null,null,null,null,null,null,null,null,null,null,null,null,null,null,null,null,null,21.8]
[null,null,null,null,null,null,null,null,null,null,null,null,null,null,null,null,null,null,null,null,null,null,null,null,null,null,21.9]
[null,null,null,null,null,null,null,null,null,null,null,null,null,null,null,null,null,null,null,null,null,null,null,null,null,null,22]
[null,null,null,null,null,null,null,null,null,null,null,null,null,null,null,null,null,null,null,null,null,null,null,null,null,null,22.1]
[null,null,null,null,null,null,null,null,null,null,null,null,null,null,null,null,null,null,null,null,null,null,null,null,null,null,22.2]
[null,null,null,null,null,null,null,null,null,null,null,null,null,null,null,null,null,null,null,null,null,null,null,null,null,null,22.3]
[null,null,null,null,null,null,null,null,null,null,null,null,null,null,null,null,null,null,null,null,null,null,null,null,null,null,22.4]
[null,null,null,null,null,null,null,null,null,null,null,null,null,null,null,null,null,null,null,null,null,null,null,null,null,null,22.5]
[null,null,null,null,null,null,null,null,null,null,null,null,null,null,null,null,null,null,null,null,null,null,null,null,null,null,22.6]
[null,null,null,null,null,null,null,null,null,null,null,null,null,null,null,null,null,null,null,null,null,null,null,null,null,null,22.7]
[null,null,null,null,null,null,null,null,null,null,null,null,null,null,null,null,null,null,null,null,null,null,null,null,null,null,22.8]
[null,null,null,null,null,null,null,null,null,null,null,null,null,null,null,null,null,null,null,null,null,null,null,null,null,null,22.9]
[null,null,null,null,null,null,null,null,null,null,null,null,null,null,null,null,null,null,null,null,null,null,null,null,null,null,23]
[null,null,null,null,null,null,null,null,null,null,null,null,null,null,null,null,null,null,null,null,null,null,null,null,null,null,23.1]
[null,null,null,null,null,null,null,null,null,null,null,null,null,null,null,null,null,null,null,null,null,null,null,null,null,null,23.2]
[null,null,null,null,null,null,null,null,null,null,null,null,null,null,null,null,null,null,null,null,null,null,null,null,null,null,23.3]
[null,null,null,null,null,null,null,null,null,null,null,null,null,null,null,null,null,null,null,null,null,null,null,null,null,null,23.4]
[null,null,null,null,null,null,null,null,null,null,null,null,null,null,null,null,null,null,null,null,null,null,null,null,null,null,23.5]
[null,null,null,null,null,null,null,null,null,null,null,null,null,null,null,null,null,null,null,null,null,null,null,null,null,null,23.6]
[null,null,null,null,null,null,null,null,null,null,null,null,null,null,null,null,null,null,null,null,null,null,null,null,null,null,23.7]
[null,null,null,null,null,null,null,null,null,null,null,null,null,null,null,null,null,null,null,null,null,null,null,null,null,null,23.8]
[null,null,null,null,null,null,null,null,null,null,null,null,null,null,null,null,null,null,null,null,null,null,null,null,null,null,23.9]
[null,null,null,null,null,null,null,null,null,null,null,null,null,null,null,null,null,null,null,null,null,null,null,null,null,null,24,24]
[null,null,null,null,null,null,null,null,null,null,null,null,null,null,null,null,null,null,null,null,null,null,null,null,null,null,24.1,24.1]
[null,null,null,null,null,null,null,null,null,null,null,null,null,null,null,null,null,null,null,null,null,null,null,null,null,null,24.2,24.2]
[null,null,null,null,null,null,null,null,null,null,null,null,null,null,null,null,null,null,null,null,null,null,null,null,null,null,24.3,24.3]
[null,null,null,null,null,null,null,null,null,null,null,null,null,null,null,null,null,null,null,null,null,null,null,null,null,null,24.4,24.4]
[null,null,null,null,null,null,null,null,null,null,null,null,null,null,null,null,null,null,null,null,null,null,null,null,null,null,24.5,24.5]
[null,null,null,null,null,null,null,null,null,null,null,null,null,null,null,null,null,null,null,null,null,null,null,null,null,null,24.6,24.6]
[null,null,null,null,null,null,null,null,null,null,null,null,null,null,null,null,null,null,null,null,null,null,null,null,null,null,24.7,24.7]
[null,null,null,null,null,null,null,null,null,null,null,null,null,null,null,null,null,null,null,null,null,null,null,null,null,null,24.8,24.8]
[null,null,null,null,null,null,null,null,null,null,null,null,null,null,null,null,null,null,null,null,null,null,null,null,null,null,24.9,24.9]
[null,null,null,null,null,null,null,null,null,null,null,null,null,null,null,null,null,null,null,null,null,null,null,null,null,null,25,25]
[null,null,null,null,null,null,null,null,null,null,null,null,null,null,null,null,null,null,null,null,null,null,null,null,null,null,25.1,25.1]
[null,null,null,null,null,null,null,null,null,null,null,null,null,null,null,null,null,null,null,null,null,null,null,null,null,null,25.2,25.2]
[null,null,null,null,null,null,null,null,null,null,null,null,null,null,null,null,null,null,null,null,null,null,null,null,null,null,25.3,25.3]
[null,null,null,null,null,null,null,null,null,null,null,null,null,null,null,null,null,null,null,null,null,null,null,null,null,null,25.4,25.4]
[null,null,null,null,null,null,null,null,null,null,null,null,null,null,null,null,null,null,null,null,null,null,null,null,null,null,25.5,25.5]
[null,null,null,null,null,null,null,null,null,null,null,null,null,null,null,null,null,null,null,null,null,null,null,null,null,null,25.6,25.6]
[null,null,null,null,null,null,null,null,null,null,null,null,null,null,null,null,null,null,null,null,null,null,null,null,null,null,25.7,25.7]
[null,null,null,null,null,null,null,null,null,null,null,null,null,null,null,null,null,null,null,null,null,null,null,null,null,null,25.8,25.8]
[null,null,null,null,null,null,null,null,null,null,null,null,null,null,null,null,null,null,null,null,null,null,null,null,null,null,25.9,25.9]
[null,null,null,null,null,null,null,null,null,null,null,null,null,null,null,null,null,null,null,null,null,null,null,null,null,null,26,26]
[null,null,null,null,null,null,null,null,null,null,null,null,null,null,null,null,null,null,null,null,null,null,null,null,null,null,26.1,26.1]
[null,null,null,null,null,null,null,null,null,null,null,null,null,null,null,null,null,null,null,null,null,null,null,null,null,null,26.2,26.2]
[null,null,null,null,null,null,null,null,null,null,null,null,null,null,null,null,null,null,null,null,null,null,null,null,null,null,26.3,26.3]
[null,null,null,null,null,null,null,null,null,null,null,null,null,null,null,null,null,null,null,null,null,null,null,null,null,null,26.4,26.4]
[null,null,null,null,null,null,null,null,null,null,null,null,null,null,null,null,null,null,null,null,null,null,null,null,null,null,26.5,26.5]
[null,null,null,null,null,null,null,null,null,null,null,null,null,null,null,null,null,null,null,null,null,null,null,null,null,null,26.6,26.6]
[null,null,null,null,null,null,null,null,null,null,null,null,null,null,null,null,null,null,null,null,null,null,null,null,null,null,26.7,26.7]
[null,null,null,null,null,null,null,null,null,null,null,null,null,null,null,null,null,null,null,null,null,null,null,null,null,null,26.8,26.8]
[null,null,null,null,null,null,null,null,null,null,null,null,null,null,null,null,null,null,null,null,null,null,null,null,null,null,26.9,26.9]
[null,null,null,null,null,null,null,null,null,null,null,null,null,null,null,null,null,null,null,null,null,null,null,null,null,null,27,27]
[null,null,null,null,null,null,null,null,null,null,null,null,null,null,null,null,null,null,null,null,null,null,null,null,null,null,27.1,27.1]
[null,null,null,null,null,null,null,null,null,null,null,null,null,null,null,null,null,null,null,null,null,null,null,null,null,null,27.2,27.2]
[null,null,null,null,null,null,null,null,null,null,null,null,null,null,null,null,null,null,null,null,null,null,null,null,null,null,27.3,27.3]
[null,null,null,null,null,null,null,null,null,null,null,null,null,null,null,null,null,null,null,null,null,null,null,null,null,null,27.4,27.4]
[null,null,null,null,null,null,null,null,null,null,null,null,null,null,null,null,null,null,null,null,null,null,null,null,null,null,27.5,27.5]
[null,null,null,null,null,null,null,null,null,null,null,null,null,null,null,null,null,null,null,null,null,null,null,null,null,null,27.6,27.6]
[null,null,null,null,null,null,null,null,null,null,null,null,null,null,null,null,null,null,null,null,null,null,null,null,null,null,27.7,27.7]
[null,null,null,null,null,null,null,null,null,null,null,null,null,null,null,null,null,null,null,null,null,null,null,null,null,null,27.8,27.8]
[null,null,null,null,null,null,null,null,null,null,null,null,null,null,null,null,null,null,null,null,null,null,null,null,null,null,27.9,27.9]
[null,null,null,null,null,null,null,null,null,null,null,null,null,null,null,null,null,null,null,null,null,null,null,null,null,null,28,28]
[null,null,null,null,null,null,null,null,null,null,null,null,null,null,null,null,null,null,null,null,null,null,null,null,null,null,28.1,28.1]
[null,null,null,null,null,null,null,null,null,null,null,null,null,null,null,null,null,null,null,null,null,null,null,null,null,null,28.2,28.2]
[null,null,null,null,null,null,null,null,null,null,null,null,null,null,null,null,null,null,null,null,null,null,null,null,null,null,28.3,28.3]
[null,null,null,null,null,null,null,null,null,null,null,null,null,null,null,null,null,null,null,null,null,null,null,null,null,null,28.4,28.4]
[null,null,null,null,null,null,null,null,null,null,null,null,null,null,null,null,null,null,null,null,null,null,null,null,null,null,28.5,28.5]
[null,null,null,null,null,null,null,null,null,null,null,null,null,null,null,null,null,null,null,null,null,null,null,null,null,null,28.6,28.6]
[null,null,null,null,null,null,null,null,null,null,null,null,null,null,null,null,null,null,null,null,null,null,null,null,null,null,28.7,28.7]
[null,null,null,null,null,null,null,null,null,null,null,null,null,null,null,null,null,null,null,null,null,null,null,null,null,null,28.8,28.8]
[null,null,null,null,null,null,null,null,null,null,null,null,null,null,null,null,null,null,null,null,null,null,null,null,null,null,28.9,28.9]
[null,null,null,null,null,null,null,null,null,null,null,null,null,null,null,null,null,null,null,null,null,null,null,null,null,null,29,29]
[null,null,null,null,null,null,null,null,null,null,null,null,null,null,null,null,null,null,null,null,null,null,null,null,null,null,29.1,29.1]
[null,null,null,null,null,null,null,null,null,null,null,null,null,null,null,null,null,null,null,null,null,null,null,null,null,null,29.2,29.2]
[null,null,null,null,null,null,null,null,null,null,null,null,null,null,null,null,null,null,null,null,null,null,null,null,null,null,29.3,29.3]
[null,null,null,null,null,null,null,null,null,null,null,null,null,null,null,null,null,null,null,null,null,null,null,null,null,null,29.4,29.4]
[null,null,null,null,null,null,null,null,null,null,null,null,null,null,null,null,null,null,null,null,null,null,null,null,null,null,29.5,29.5]
[null,null,null,null,null,null,null,null,null,null,null,null,null,null,null,null,null,null,null,null,null,null,null,null,null,null,29.6,29.6]
[null,null,null,null,null,null,null,null,null,null,null,null,null,null,null,null,null,null,null,null,null,null,null,null,null,null,29.7,29.7]
[null,null,null,null,null,null,null,null,null,null,null,null,null,null,null,null,null,null,null,null,null,null,null,null,null,null,29.8,29.8]
[null,null,null,null,null,null,null,null,null,null,null,null,null,null,null,null,null,null,null,null,null,null,null,null,null,null,29.9,29.9]
[null,null,null,null,null,null,null,null,null,null,null,null,null,null,null,null,null,null,null,null,null,null,null,null,null,null,30,30]
[null,null,null,null,null,null,null,null,null,null,null,null,null,null,null,null,null,null,null,null,null,null,null,null,null,null,30.1,30.1]
[null,null,null,null,null,null,null,null,null,null,null,null,null,null,null,null,null,null,null,null,null,null,null,null,null,null,30.2,30.2]
[null,null,null,null,null,null,null,null,null,null,null,null,null,null,null,null,null,null,null,null,null,null,null,null,null,null,30.3,30.3]
[null,null,null,null,null,null,null,null,null,null,null,null,null,null,null,null,null,null,null,null,null,null,null,null,null,null,30.4,30.4]
[null,null,null,null,null,null,null,null,null,null,null,null,null,null,null,null,null,null,null,null,null,null,null,null,null,null,30.5,30.5]
[null,null,null,null,null,null,null,null,null,null,null,null,null,null,null,null,null,null,null,null,null,null,null,null,null,null,30.6,30.6]
[null,null,null,null,null,null,null,null,null,null,null,null,null,null,null,null,null,null,null,null,null,null,null,null,null,null,30.7,30.7]
[null,null,null,null,null,null,null,null,null,null,null,null,null,null,null,null,null,null,null,null,null,null,null,null,null,null,30.8,30.8]
[null,null,null,null,null,null,null,null,null,null,null,null,null,null,null,null,null,null,null,null,null,null,null,null,null,null,30.9,30.9]
[null,null,null,null,null,null,null,null,null,null,null,null,null,null,null,null,null,null,null,null,null,null,null,null,null,null,31,31]
[null,null,null,null,null,null,null,null,null,null,null,null,null,null,null,null,null,null,null,null,null,null,null,null,null,null,31.1,31.1]
[null,null,null,null,null,null,null,null,null,null,null,null,null,null,null,null,null,null,null,null,null,null,null,null,null,null,31.2,31.2]
[null,null,null,null,null,null,null,null,null,null,null,null,null,null,null,null,null,null,null,null,null,null,null,null,null,null,31.3,31.3]
[null,null,null,null,null,null,null,null,null,null,null,null,null,null,null,null,null,null,null,null,null,null,null,null,null,null,31.4,31.4]
[null,null,null,null,null,null,null,null,null,null,null,null,null,null,null,null,null,null,null,null,null,null,null,null,null,null,31.5,31.5]
[null,null,null,null,null,null,null,null,null,null,null,null,null,null,null,null,null,null,null,null,null,null,null,null,null,null,31.6,31.6]
[null,null,null,null,null,null,null,null,null,null,null,null,null,null,null,null,null,null,null,null,null,null,null,null,null,null,31.7,31.7]
[null,null,null,null,null,null,null,null,null,null,null,null,null,null,null,null,null,null,null,null,null,null,null,null,null,null,31.8,31.8]
[null,null,null,null,null,null,null,null,null,null,null,null,null,null,null,null,null,null,null,null,null,null,null,null,null,null,31.9,31.9]
[null,null,null,null,null,null,null,null,null,null,null,null,null,null,null,null,null,null,null,null,null,null,null,null,null,null,32,32]
[null,null,null,null,null,null,null,null,null,null,null,null,null,null,null,null,null,null,null,null,null,null,null,null,null,null,32.1,32.1]
[null,null,null,null,null,null,null,null,null,null,null,null,null,null,null,null,null,null,null,null,null,null,null,null,null,null,32.200000000000003,32.200000000000003]
[null,null,null,null,null,null,null,null,null,null,null,null,null,null,null,null,null,null,null,null,null,null,null,null,null,null,32.299999999999997,32.299999999999997]
[null,null,null,null,null,null,null,null,null,null,null,null,null,null,null,null,null,null,null,null,null,null,null,null,null,null,32.4,32.4]
[null,null,null,null,null,null,null,null,null,null,null,null,null,null,null,null,null,null,null,null,null,null,null,null,null,null,32.5,32.5]
[null,null,null,null,null,null,null,null,null,null,null,null,null,null,null,null,null,null,null,null,null,null,null,null,null,null,32.6,32.6]
[null,null,null,null,null,null,null,null,null,null,null,null,null,null,null,null,null,null,null,null,null,null,null,null,null,null,32.700000000000003,32.700000000000003]
[null,null,null,null,null,null,null,null,null,null,null,null,null,null,null,null,null,null,null,null,null,null,null,null,null,null,32.799999999999997,32.799999999999997]
[null,null,null,null,null,null,null,null,null,null,null,null,null,null,null,null,null,null,null,null,null,null,null,null,null,null,32.9,32.9]
[null,null,null,null,null,null,null,null,null,null,null,null,null,null,null,null,null,null,null,null,null,null,null,null,null,null,33,33]
[null,null,null,null,null,null,null,null,null,null,null,null,null,null,null,null,null,null,null,null,null,null,null,null,null,null,33.1,33.1]
[null,null,null,null,null,null,null,null,null,null,null,null,null,null,null,null,null,null,null,null,null,null,null,null,null,null,33.200000000000003,33.200000000000003]
[null,null,null,null,null,null,null,null,null,null,null,null,null,null,null,null,null,null,null,null,null,null,null,null,null,null,33.299999999999997,33.299999999999997]
[null,null,null,null,null,null,null,null,null,null,null,null,null,null,null,null,null,null,null,null,null,null,null,null,null,null,33.4,33.4]
[null,null,null,null,null,null,null,null,null,null,null,null,null,null,null,null,null,null,null,null,null,null,null,null,null,null,33.5,33.5]
[null,null,null,null,null,null,null,null,null,null,null,null,null,null,null,null,null,null,null,null,null,null,null,null,null,null,33.6,33.6]
[null,null,null,null,null,null,null,null,null,null,null,null,null,null,null,null,null,null,null,null,null,null,null,null,null,null,33.700000000000003,33.700000000000003]
[null,null,null,null,null,null,null,null,null,null,null,null,null,null,null,null,null,null,null,null,null,null,null,null,null,null,33.799999999999997,33.799999999999997]
[null,null,null,null,null,null,null,null,null,null,null,null,null,null,null,null,null,null,null,null,null,null,null,null,null,null,33.9,33.9]
[null,null,null,null,null,null,null,null,null,null,null,null,null,null,null,null,null,null,null,null,null,null,null,null,null,null,34,34]
[null,null,null,null,null,null,null,null,null,null,null,null,null,null,null,null,null,null,null,null,null,null,null,null,null,null,34.1,34.1]
[null,null,null,null,null,null,null,null,null,null,null,null,null,null,null,null,null,null,null,null,null,null,null,null,null,null,34.200000000000003,34.200000000000003]
[null,null,null,null,null,null,null,null,null,null,null,null,null,null,null,null,null,null,null,null,null,null,null,null,null,null,34.299999999999997,34.299999999999997]
[null,null,null,null,null,null,null,null,null,null,null,null,null,null,null,null,null,null,null,null,null,null,null,null,null,null,34.4,34.4]
[null,null,null,null,null,null,null,null,null,null,null,null,null,null,null,null,null,null,null,null,null,null,null,null,null,null,34.5,34.5]
[null,null,null,null,null,null,null,null,null,null,null,null,null,null,null,null,null,null,null,null,null,null,null,null,null,null,34.6,34.6]
[null,null,null,null,null,null,null,null,null,null,null,null,null,null,null,null,null,null,null,null,null,null,null,null,null,null,34.700000000000003,34.700000000000003]
[null,null,null,null,null,null,null,null,null,null,null,null,null,null,null,null,null,null,null,null,null,null,null,null,null,null,34.799999999999997,34.799999999999997]
[null,null,null,null,null,null,null,null,null,null,null,null,null,null,null,null,null,null,null,null,null,null,null,null,null,null,34.9,34.9]
[null,null,null,null,null,null,null,null,null,null,null,null,null,null,null,null,null,null,null,null,null,null,null,null,null,null,35,35]
[null,null,null,null,null,null,null,null,null,null,null,null,null,null,null,null,null,null,null,null,null,null,null,null,null,null,35.1,35.1]
[null,null,null,null,null,null,null,null,null,null,null,null,null,null,null,null,null,null,null,null,null,null,null,null,null,null,35.200000000000003,35.200000000000003]
[null,null,null,null,null,null,null,null,null,null,null,null,null,null,null,null,null,null,null,null,null,null,null,null,null,null,35.299999999999997,35.299999999999997]
[null,null,null,null,null,null,null,null,null,null,null,null,null,null,null,null,null,null,null,null,null,null,null,null,null,null,35.4,35.4]
[null,null,null,null,null,null,null,null,null,null,null,null,null,null,null,null,null,null,null,null,null,null,null,null,null,null,35.5,35.5]
[null,null,null,null,null,null,null,null,null,null,null,null,null,null,null,null,null,null,null,null,null,null,null,null,null,null,35.6,35.6]
[null,null,null,null,null,null,null,null,null,null,null,null,null,null,null,null,null,null,null,null,null,null,null,null,null,null,35.700000000000003,35.700000000000003]
[null,null,null,null,null,null,null,null,null,null,null,null,null,null,null,null,null,null,null,null,null,null,null,null,null,null,35.799999999999997,35.799999999999997]
[null,null,null,null,null,null,null,null,null,null,null,null,null,null,null,null,null,null,null,null,null,null,null,null,null,null,35.9,35.9]
[null,null,null,null,null,null,null,null,null,null,null,null,null,null,null,null,null,null,null,null,null,null,null,null,null,null,36,36]
[null,null,null,null,null,null,null,null,null,null,null,null,null,null,null,null,null,null,null,null,null,null,null,null,null,null,36.1,36.1]
[null,null,null,null,null,null,null,null,null,null,null,null,null,null,null,null,null,null,null,null,null,null,null,null,null,null,36.200000000000003,36.200000000000003]
[null,null,null,null,null,null,null,null,null,null,null,null,null,null,null,null,null,null,null,null,null,null,null,null,null,null,36.299999999999997,36.299999999999997]
[null,null,null,null,null,null,null,null,null,null,null,null,null,null,null,null,null,null,null,null,null,null,null,null,null,null,36.4,36.4]
[null,null,null,null,null,null,null,null,null,null,null,null,null,null,null,null,null,null,null,null,null,null,null,null,null,null,36.5,36.5]
[null,null,null,null,null,null,null,null,null,null,null,null,null,null,null,null,null,null,null,null,null,null,null,null,null,null,36.6,36.6]
[null,null,null,null,null,null,null,null,null,null,null,null,null,null,null,null,null,null,null,null,null,null,null,null,null,null,36.700000000000003,36.700000000000003]
[null,null,null,null,null,null,null,null,null,null,null,null,null,null,null,null,null,null,null,null,null,null,null,null,null,null,36.799999999999997,36.799999999999997]
[null,null,null,null,null,null,null,null,null,null,null,null,null,null,null,null,null,null,null,null,null,null,null,null,null,null,36.9,36.9]
[null,null,null,null,null,null,null,null,null,null,null,null,null,null,null,null,null,null,null,null,null,null,null,null,null,null,37,37]
[null,null,null,null,null,null,null,null,null,null,null,null,null,null,null,null,null,null,null,null,null,null,null,null,null,null,37.1,37.1]
[null,null,null,null,null,null,null,null,null,null,null,null,null,null,null,null,null,null,null,null,null,null,null,null,null,null,37.200000000000003,37.200000000000003]
[null,null,null,null,null,null,null,null,null,null,null,null,null,null,null,null,null,null,null,null,null,null,null,null,null,null,37.299999999999997,37.299999999999997]
[null,null,null,null,null,null,null,null,null,null,null,null,null,null,null,null,null,null,null,null,null,null,null,null,null,null,37.4,37.4]
[null,null,null,null,null,null,null,null,null,null,null,null,null,null,null,null,null,null,null,null,null,null,null,null,null,null,37.5,37.5]
[null,null,null,null,null,null,null,null,null,null,null,null,null,null,null,null,null,null,null,null,null,null,null,null,null,null,37.6,37.6]
[null,null,null,null,null,null,null,null,null,null,null,null,null,null,null,null,null,null,null,null,null,null,null,null,null,null,37.700000000000003,37.700000000000003]
[null,null,null,null,null,null,null,null,null,null,null,null,null,null,null,null,null,null,null,null,null,null,null,null,null,null,37.799999999999997,37.799999999999997]
[null,null,null,null,null,null,null,null,null,null,null,null,null,null,null,null,null,null,null,null,null,null,null,null,null,null,37.9,37.9]
[null,null,null,null,null,null,null,null,null,null,null,null,null,null,null,null,null,null,null,null,null,null,null,null,null,null,38,38]
[null,null,null,null,null,null,null,null,null,null,null,null,null,null,null,null,null,null,null,null,null,null,null,null,null,null,38.1,38.1]
[null,null,null,null,null,null,null,null,null,null,null,null,null,null,null,null,null,null,null,null,null,null,null,null,null,null,38.200000000000003,38.200000000000003]
[null,null,null,null,null,null,null,null,null,null,null,null,null,null,null,null,null,null,null,null,null,null,null,null,null,null,38.299999999999997,38.299999999999997]
[null,null,null,null,null,null,null,null,null,null,null,null,null,null,null,null,null,null,null,null,null,null,null,null,null,null,38.4,38.4]
[null,null,null,null,null,null,null,null,null,null,null,null,null,null,null,null,null,null,null,null,null,null,null,null,null,null,38.5,38.5]
[null,null,null,null,null,null,null,null,null,null,null,null,null,null,null,null,null,null,null,null,null,null,null,null,null,null,38.6,38.6]
[null,null,null,null,null,null,null,null,null,null,null,null,null,null,null,null,null,null,null,null,null,null,null,null,null,null,38.700000000000003,38.700000000000003]
[null,null,null,null,null,null,null,null,null,null,null,null,null,null,null,null,null,null,null,null,null,null,null,null,null,null,38.799999999999997,38.799999999999997]
[null,null,null,null,null,null,null,null,null,null,null,null,null,null,null,null,null,null,null,null,null,null,null,null,null,null,38.9,38.9]
[null,null,null,null,null,null,null,null,null,null,null,null,null,null,null,null,null,null,null,null,null,null,null,null,null,null,39,39]
[null,null,null,null,null,null,null,null,null,null,null,null,null,null,null,null,null,null,null,null,null,null,null,null,null,null,39.1,39.1]
[null,null,null,null,null,null,null,null,null,null,null,null,null,null,null,null,null,null,null,null,null,null,null,null,null,null,39.200000000000003,39.200000000000003]
[null,null,null,null,null,null,null,null,null,null,null,null,null,null,null,null,null,null,null,null,null,null,null,null,null,null,39.299999999999997,39.299999999999997]
[null,null,null,null,null,null,null,null,null,null,null,null,null,null,null,null,null,null,null,null,null,null,null,null,null,null,39.4,39.4]
[null,null,null,null,null,null,null,null,null,null,null,null,null,null,null,null,null,null,null,null,null,null,null,null,null,null,39.5,39.5]
[null,null,null,null,null,null,null,null,null,null,null,null,null,null,null,null,null,null,null,null,null,null,null,null,null,null,39.6,39.6]
[null,null,null,null,null,null,null,null,null,null,null,null,null,null,null,null,null,null,null,null,null,null,null,null,null,null,39.700000000000003,39.700000000000003]
[null,null,null,null,null,null,null,null,null,null,null,null,null,null,null,null,null,null,null,null,null,null,null,null,null,null,39.799999999999997,39.799999999999997]
[null,null,null,null,null,null,null,null,null,null,null,null,null,null,null,null,null,null,null,null,null,null,null,null,null,null,39.9,39.9]
[null,null,null,null,null,null,null,null,null,null,null,null,null,null,null,null,null,null,null,null,null,null,null,null,null,null,40,40]
[null,null,null,null,null,null,null,null,null,null,null,null,null,null,null,null,null,null,null,null,null,null,null,null,null,null,40.1,40.1]
[null,null,null,null,null,null,null,null,null,null,null,null,null,null,null,null,null,null,null,null,null,null,null,null,null,null,40.200000000000003,40.200000000000003]
[null,null,null,null,null,null,null,null,null,null,null,null,null,null,null,null,null,null,null,null,null,null,null,null,null,null,40.299999999999997,40.299999999999997]
[null,null,null,null,null,null,null,null,null,null,null,null,null,null,null,null,null,null,null,null,null,null,null,null,null,null,40.4,40.4]
[null,null,null,null,null,null,null,null,null,null,null,null,null,null,null,null,null,null,null,null,null,null,null,null,null,null,40.5,40.5]
[null,null,null,null,null,null,null,null,null,null,null,null,null,null,null,null,null,null,null,null,null,null,null,null,null,null,40.6,40.6]
[null,null,null,null,null,null,null,null,null,null,null,null,null,null,null,null,null,null,null,null,null,null,null,null,null,null,40.700000000000003,40.700000000000003]
[null,null,null,null,null,null,null,null,null,null,null,null,null,null,null,null,null,null,null,null,null,null,null,null,null,null,40.799999999999997,40.799999999999997]
[null,null,null,null,null,null,null,null,null,null,null,null,null,null,null,null,null,null,null,null,null,null,null,null,null,null,40.9,40.9]
[null,null,null,null,null,null,null,null,null,null,null,null,null,null,null,null,null,null,null,null,null,null,null,null,null,null,41,41]
[null,null,null,null,null,null,null,null,null,null,null,null,null,null,null,null,null,null,null,null,null,null,null,null,null,null,41.1,41.1]
[null,null,null,null,null,null,null,null,null,null,null,null,null,null,null,null,null,null,null,null,null,null,null,null,null,null,41.2,41.2]
[null,null,null,null,null,null,null,null,null,null,null,null,null,null,null,null,null,null,null,null,null,null,null,null,null,null,41.3,41.3]
[null,null,null,null,null,null,null,null,null,null,null,null,null,null,null,null,null,null,null,null,null,null,null,null,null,null,41.4,41.4]
[null,null,null,null,null,null,null,null,null,null,null,null,null,null,null,null,null,null,null,null,null,null,null,null,null,null,41.5,41.5]
[null,null,null,null,null,null,null,null,null,null,null,null,null,null,null,null,null,null,null,null,null,null,null,null,null,null,41.6,41.6]
[null,null,null,null,null,null,null,null,null,null,null,null,null,null,null,null,null,null,null,null,null,null,null,null,null,null,41.7,41.7]
[null,null,null,null,null,null,null,null,null,null,null,null,null,null,null,null,null,null,null,null,null,null,null,null,null,null,41.8,41.8]
[null,null,null,null,null,null,null,null,null,null,null,null,null,null,null,null,null,null,null,null,null,null,null,null,null,null,41.9,41.9]
[null,null,null,null,null,null,null,null,null,null,null,null,null,null,null,null,null,null,null,null,null,null,null,null,null,null,42,42]
[null,null,null,null,null,null,null,null,null,null,null,null,null,null,null,null,null,null,null,null,null,null,null,null,null,null,42.1,42.1]
[null,null,null,null,null,null,null,null,null,null,null,null,null,null,null,null,null,null,null,null,null,null,null,null,null,null,42.2,42.2]
[null,null,null,null,null,null,null,null,null,null,null,null,null,null,null,null,null,null,null,null,null,null,null,null,null,null,42.3,42.3]
[null,null,null,null,null,null,null,null,null,null,null,null,null,null,null,null,null,null,null,null,null,null,null,null,null,null,42.4,42.4]
[null,null,null,null,null,null,null,null,null,null,null,null,null,null,null,null,null,null,null,null,null,null,null,null,null,null,42.5,42.5]
[null,null,null,null,null,null,null,null,null,null,null,null,null,null,null,null,null,null,null,null,null,null,null,null,null,null,42.6,42.6]
[null,null,null,null,null,null,null,null,null,null,null,null,null,null,null,null,null,null,null,null,null,null,null,null,null,null,42.7,42.7]
[null,null,null,null,null,null,null,null,null,null,null,null,null,null,null,null,null,null,null,null,null,null,null,null,null,null,42.8,42.8]
[null,null,null,null,null,null,null,null,null,null,null,null,null,null,null,null,null,null,null,null,null,null,null,null,null,null,42.9,42.9]
[null,null,null,null,null,null,null,null,null,null,null,null,null,null,null,null,null,null,null,null,null,null,null,null,null,null,43,43]
[null,null,null,null,null,null,null,null,null,null,null,null,null,null,null,null,null,null,null,null,null,null,null,null,null,null,43.1,43.1]
[null,null,null,null,null,null,null,null,null,null,null,null,null,null,null,null,null,null,null,null,null,null,null,null,null,null,43.2,43.2]
[null,null,null,null,null,null,null,null,null,null,null,null,null,null,null,null,null,null,null,null,null,null,null,null,null,null,43.3,43.3]
[null,null,null,null,null,null,null,null,null,null,null,null,null,null,null,null,null,null,null,null,null,null,null,null,null,null,43.4,43.4]
[null,null,null,null,null,null,null,null,null,null,null,null,null,null,null,null,null,null,null,null,null,null,null,null,null,null,43.5,43.5]
[null,null,null,null,null,null,null,null,null,null,null,null,null,null,null,null,null,null,null,null,null,null,null,null,null,null,43.6,43.6]
[null,null,null,null,null,null,null,null,null,null,null,null,null,null,null,null,null,null,null,null,null,null,null,null,null,null,43.7,43.7]
[null,null,null,null,null,null,null,null,null,null,null,null,null,null,null,null,null,null,null,null,null,null,null,null,null,null,43.8,43.8]
[null,null,null,null,null,null,null,null,null,null,null,null,null,null,null,null,null,null,null,null,null,null,null,null,null,null,43.9,43.9]
[null,null,null,null,null,null,null,null,null,null,null,null,null,null,null,null,null,null,null,null,null,null,null,null,null,null,44,44]
[null,null,null,null,null,null,null,null,null,null,null,null,null,null,null,null,null,null,null,null,null,null,null,null,null,null,44.1,44.1]
[null,null,null,null,null,null,null,null,null,null,null,null,null,null,null,null,null,null,null,null,null,null,null,null,null,null,44.2,44.2]
[null,null,null,null,null,null,null,null,null,null,null,null,null,null,null,null,null,null,null,null,null,null,null,null,null,null,44.3,44.3]
[null,null,null,null,null,null,null,null,null,null,null,null,null,null,null,null,null,null,null,null,null,null,null,null,null,null,44.4,44.4]
[null,null,null,null,null,null,null,null,null,null,null,null,null,null,null,null,null,null,null,null,null,null,null,null,null,null,44.5,44.5]
[null,null,null,null,null,null,null,null,null,null,null,null,null,null,null,null,null,null,null,null,null,null,null,null,null,null,44.6,44.6]
[null,null,null,null,null,null,null,null,null,null,null,null,null,null,null,null,null,null,null,null,null,null,null,null,null,null,44.7,44.7]
[null,null,null,null,null,null,null,null,null,null,null,null,null,null,null,null,null,null,null,null,null,null,null,null,null,null,44.8,44.8]
[null,null,null,null,null,null,null,null,null,null,null,null,null,null,null,null,null,null,null,null,null,null,null,null,null,null,44.9,44.9]
[null,null,null,null,null,null,null,null,null,null,null,null,null,null,null,null,null,null,null,null,null,null,null,null,null,null,45,45]
[null,null,null,null,null,null,null,null,null,null,null,null,null,null,null,null,null,null,null,null,null,null,null,null,null,null,45.1,45.1]
[null,null,null,null,null,null,null,null,null,null,null,null,null,null,null,null,null,null,null,null,null,null,null,null,null,null,45.2,45.2]
[null,null,null,null,null,null,null,null,null,null,null,null,null,null,null,null,null,null,null,null,null,null,null,null,null,null,45.3,45.3]
[null,null,null,null,null,null,null,null,null,null,null,null,null,null,null,null,null,null,null,null,null,null,null,null,null,null,45.4,45.4]
[null,null,null,null,null,null,null,null,null,null,null,null,null,null,null,null,null,null,null,null,null,null,null,null,null,null,45.5,45.5]
[null,null,null,null,null,null,null,null,null,null,null,null,null,null,null,null,null,null,null,null,null,null,null,null,null,null,45.6,45.6]
[null,null,null,null,null,null,null,null,null,null,null,null,null,null,null,null,null,null,null,null,null,null,null,null,null,null,45.7,45.7]
[null,null,null,null,null,null,null,null,null,null,null,null,null,null,null,null,null,null,null,null,null,null,null,null,null,null,45.8,45.8]
[null,null,null,null,null,null,null,null,null,null,null,null,null,null,null,null,null,null,null,null,null,null,null,null,null,null,45.9,45.9]
[null,null,null,null,null,null,null,null,null,null,null,null,null,null,null,null,null,null,null,null,null,null,null,null,null,null,46,46]
[null,null,null,null,null,null,null,null,null,null,null,null,null,null,null,null,null,null,null,null,null,null,null,null,null,null,46.1,46.1]
[null,null,null,null,null,null,null,null,null,null,null,null,null,null,null,null,null,null,null,null,null,null,null,null,null,null,46.2,46.2]
[null,null,null,null,null,null,null,null,null,null,null,null,null,null,null,null,null,null,null,null,null,null,null,null,null,null,46.3,46.3]
[null,null,null,null,null,null,null,null,null,null,null,null,null,null,null,null,null,null,null,null,null,null,null,null,null,null,46.4,46.4]
[null,null,null,null,null,null,null,null,null,null,null,null,null,null,null,null,null,null,null,null,null,null,null,null,null,null,46.5,46.5]
[null,null,null,null,null,null,null,null,null,null,null,null,null,null,null,null,null,null,null,null,null,null,null,null,null,null,46.6,46.6]
[null,null,null,null,null,null,null,null,null,null,null,null,null,null,null,null,null,null,null,null,null,null,null,null,null,null,46.7,46.7]
[null,null,null,null,null,null,null,null,null,null,null,null,null,null,null,null,null,null,null,null,null,null,null,null,null,null,46.8,46.8]
[null,null,null,null,null,null,null,null,null,null,null,null,null,null,null,null,null,null,null,null,null,null,null,null,null,null,46.9,46.9]
[null,null,null,null,null,null,null,null,null,null,null,null,null,null,null,null,null,null,null,null,null,null,null,null,null,null,47,47]
[null,null,null,null,null,null,null,null,null,null,null,null,null,null,null,null,null,null,null,null,null,null,null,null,null,null,47.1,47.1]
[null,null,null,null,null,null,null,null,null,null,null,null,null,null,null,null,null,null,null,null,null,null,null,null,null,null,47.2,47.2]
[null,null,null,null,null,null,null,null,null,null,null,null,null,null,null,null,null,null,null,null,null,null,null,null,null,null,47.3,47.3]
[null,null,null,null,null,null,null,null,null,null,null,null,null,null,null,null,null,null,null,null,null,null,null,null,null,null,47.4,47.4]
[null,null,null,null,null,null,null,null,null,null,null,null,null,null,null,null,null,null,null,null,null,null,null,null,null,null,47.5,47.5]
[null,null,null,null,null,null,null,null,null,null,null,null,null,null,null,null,null,null,null,null,null,null,null,null,null,null,47.6,47.6]
[null,null,null,null,null,null,null,null,null,null,null,null,null,null,null,null,null,null,null,null,null,null,null,null,null,null,47.7,47.7]
[null,null,null,null,null,null,null,null,null,null,null,null,null,null,null,null,null,null,null,null,null,null,null,null,null,null,47.8,47.8]
[null,null,null,null,null,null,null,null,null,null,null,null,null,null,null,null,null,null,null,null,null,null,null,null,null,null,47.9,47.9]
[null,null,null,null,null,null,null,null,null,null,null,null,null,null,null,null,null,null,null,null,null,null,null,null,null,null,48,48]
[null,null,null,null,null,null,null,null,null,null,null,null,null,null,null,null,null,null,null,null,null,null,null,null,null,null,48.1,48.1]
[null,null,null,null,null,null,null,null,null,null,null,null,null,null,null,null,null,null,null,null,null,null,null,null,null,null,48.2,48.2]
[null,null,null,null,null,null,null,null,null,null,null,null,null,null,null,null,null,null,null,null,null,null,null,null,null,null,48.3,48.3]
[null,null,null,null,null,null,null,null,null,null,null,null,null,null,null,null,null,null,null,null,null,null,null,null,null,null,48.4,48.4]
[null,null,null,null,null,null,null,null,null,null,null,null,null,null,null,null,null,null,null,null,null,null,null,null,null,null,48.5,48.5]
[null,null,null,null,null,null,null,null,null,null,null,null,null,null,null,null,null,null,null,null,null,null,null,null,null,null,48.6,48.6]
[null,null,null,null,null,null,null,null,null,null,null,null,null,null,null,null,null,null,null,null,null,null,null,null,null,null,48.7,48.7]
[null,null,null,null,null,null,null,null,null,null,null,null,null,null,null,null,null,null,null,null,null,null,null,null,null,null,48.8,48.8]
[null,null,null,null,null,null,null,null,null,null,null,null,null,null,null,null,null,null,null,null,null,null,null,null,null,null,48.9,48.9]
[null,null,null,null,null,null,null,null,null,null,null,null,null,null,null,null,null,null,null,null,null,null,null,null,null,null,49,49]
[null,null,null,null,null,null,null,null,null,null,null,null,null,null,null,null,null,null,null,null,null,null,null,null,null,null,49.1,49.1]
[null,null,null,null,null,null,null,null,null,null,null,null,null,null,null,null,null,null,null,null,null,null,null,null,null,null,49.2,49.2]
[null,null,null,null,null,null,null,null,null,null,null,null,null,null,null,null,null,null,null,null,null,null,null,null,null,null,49.3,49.3]
[null,null,null,null,null,null,null,null,null,null,null,null,null,null,null,null,null,null,null,null,null,null,null,null,null,null,49.4,49.4]
[null,null,null,null,null,null,null,null,null,null,null,null,null,null,null,null,null,null,null,null,null,null,null,null,null,null,49.5,49.5]
[null,null,null,null,null,null,null,null,null,null,null,null,null,null,null,null,null,null,null,null,null,null,null,null,null,null,49.6,49.6]
[null,null,null,null,null,null,null,null,null,null,null,null,null,null,null,null,null,null,null,null,null,null,null,null,null,null,49.7,49.7]
[null,null,null,null,null,null,null,null,null,null,null,null,null,null,null,null,null,null,null,null,null,null,null,null,null,null,49.8,49.8]
[null,null,null,null,null,null,null,null,null,null,null,null,null,null,null,null,null,null,null,null,null,null,null,null,null,null,49.9,49.9]
[null,null,null,null,null,null,null,null,null,null,null,null,null,null,null,null,null,null,null,null,null,null,null,null,null,null,50,50]
[null,null,null,null,null,null,null,null,null,null,null,null,null,null,null,null,null,null,null,null,null,null,null,null,null,null,null,50.1]
[null,null,null,null,null,null,null,null,null,null,null,null,null,null,null,null,null,null,null,null,null,null,null,null,null,null,null,50.2]
[null,null,null,null,null,null,null,null,null,null,null,null,null,null,null,null,null,null,null,null,null,null,null,null,null,null,null,50.3]
[null,null,null,null,null,null,null,null,null,null,null,null,null,null,null,null,null,null,null,null,null,null,null,null,null,null,null,50.4]
[null,null,null,null,null,null,null,null,null,null,null,null,null,null,null,null,null,null,null,null,null,null,null,null,null,null,null,50.5]
[null,null,null,null,null,null,null,null,null,null,null,null,null,null,null,null,null,null,null,null,null,null,null,null,null,null,null,50.6]
[null,null,null,null,null,null,null,null,null,null,null,null,null,null,null,null,null,null,null,null,null,null,null,null,null,null,null,50.7]
[null,null,null,null,null,null,null,null,null,null,null,null,null,null,null,null,null,null,null,null,null,null,null,null,null,null,null,50.8]
[null,null,null,null,null,null,null,null,null,null,null,null,null,null,null,null,null,null,null,null,null,null,null,null,null,null,null,50.9]
[null,null,null,null,null,null,null,null,null,null,null,null,null,null,null,null,null,null,null,null,null,null,null,null,null,null,null,51]
[null,null,null,null,null,null,null,null,null,null,null,null,null,null,null,null,null,null,null,null,null,null,null,null,null,null,null,51.1]
[null,null,null,null,null,null,null,null,null,null,null,null,null,null,null,null,null,null,null,null,null,null,null,null,null,null,null,51.2]
[null,null,null,null,null,null,null,null,null,null,null,null,null,null,null,null,null,null,null,null,null,null,null,null,null,null,null,51.3]
[null,null,null,null,null,null,null,null,null,null,null,null,null,null,null,null,null,null,null,null,null,null,null,null,null,null,null,51.4]
[null,null,null,null,null,null,null,null,null,null,null,null,null,null,null,null,null,null,null,null,null,null,null,null,null,null,null,51.5]
[null,null,null,null,null,null,null,null,null,null,null,null,null,null,null,null,null,null,null,null,null,null,null,null,null,null,null,51.6]
[null,null,null,null,null,null,null,null,null,null,null,null,null,null,null,null,null,null,null,null,null,null,null,null,null,null,null,51.7]
[null,null,null,null,null,null,null,null,null,null,null,null,null,null,null,null,null,null,null,null,null,null,null,null,null,null,null,51.8]
[null,null,null,null,null,null,null,null,null,null,null,null,null,null,null,null,null,null,null,null,null,null,null,null,null,null,null,51.9]
[null,null,null,null,null,null,null,null,null,null,null,null,null,null,null,null,null,null,null,null,null,null,null,null,null,null,null,52]
[null,null,null,null,null,null,null,null,null,null,null,null,null,null,null,null,null,null,null,null,null,null,null,null,null,null,null,52.1]
[null,null,null,null,null,null,null,null,null,null,null,null,null,null,null,null,null,null,null,null,null,null,null,null,null,null,null,52.2]
[null,null,null,null,null,null,null,null,null,null,null,null,null,null,null,null,null,null,null,null,null,null,null,null,null,null,null,52.3]
[null,null,null,null,null,null,null,null,null,null,null,null,null,null,null,null,null,null,null,null,null,null,null,null,null,null,null,52.4]
[null,null,null,null,null,null,null,null,null,null,null,null,null,null,null,null,null,null,null,null,null,null,null,null,null,null,null,52.5]
[null,null,null,null,null,null,null,null,null,null,null,null,null,null,null,null,null,null,null,null,null,null,null,null,null,null,null,52.6]
[null,null,null,null,null,null,null,null,null,null,null,null,null,null,null,null,null,null,null,null,null,null,null,null,null,null,null,52.7]
[null,null,null,null,null,null,null,null,null,null,null,null,null,null,null,null,null,null,null,null,null,null,null,null,null,null,null,52.8]
[null,null,null,null,null,null,null,null,null,null,null,null,null,null,null,null,null,null,null,null,null,null,null,null,null,null,null,52.9]
[null,null,null,null,null,null,null,null,null,null,null,null,null,null,null,null,null,null,null,null,null,null,null,null,null,null,null,53]
[null,null,null,null,null,null,null,null,null,null,null,null,null,null,null,null,null,null,null,null,null,null,null,null,null,null,null,53.1]
[null,null,null,null,null,null,null,null,null,null,null,null,null,null,null,null,null,null,null,null,null,null,null,null,null,null,null,53.2]
[null,null,null,null,null,null,null,null,null,null,null,null,null,null,null,null,null,null,null,null,null,null,null,null,null,null,null,53.3]
[null,null,null,null,null,null,null,null,null,null,null,null,null,null,null,null,null,null,null,null,null,null,null,null,null,null,null,53.4]
[null,null,null,null,null,null,null,null,null,null,null,null,null,null,null,null,null,null,null,null,null,null,null,null,null,null,null,53.5]
[null,null,null,null,null,null,null,null,null,null,null,null,null,null,null,null,null,null,null,null,null,null,null,null,null,null,null,53.6]
[null,null,null,null,null,null,null,null,null,null,null,null,null,null,null,null,null,null,null,null,null,null,null,null,null,null,null,53.7]
[null,null,null,null,null,null,null,null,null,null,null,null,null,null,null,null,null,null,null,null,null,null,null,null,null,null,null,53.8]
[null,null,null,null,null,null,null,null,null,null,null,null,null,null,null,null,null,null,null,null,null,null,null,null,null,null,null,53.9]
[null,null,null,null,null,null,null,null,null,null,null,null,null,null,null,null,null,null,null,null,null,null,null,null,null,null,null,54]
[null,null,null,null,null,null,null,null,null,null,null,null,null,null,null,null,null,null,null,null,null,null,null,null,null,null,null,54.1]
[null,null,null,null,null,null,null,null,null,null,null,null,null,null,null,null,null,null,null,null,null,null,null,null,null,null,null,54.2]
[null,null,null,null,null,null,null,null,null,null,null,null,null,null,null,null,null,null,null,null,null,null,null,null,null,null,null,54.3]
[null,null,null,null,null,null,null,null,null,null,null,null,null,null,null,null,null,null,null,null,null,null,null,null,null,null,null,54.4]
[null,null,null,null,null,null,null,null,null,null,null,null,null,null,null,null,null,null,null,null,null,null,null,null,null,null,null,54.5]
[null,null,null,null,null,null,null,null,null,null,null,null,null,null,null,null,null,null,null,null,null,null,null,null,null,null,null,54.6]
[null,null,null,null,null,null,null,null,null,null,null,null,null,null,null,null,null,null,null,null,null,null,null,null,null,null,null,54.7]
[null,null,null,null,null,null,null,null,null,null,null,null,null,null,null,null,null,null,null,null,null,null,null,null,null,null,null,54.8]
[null,null,null,null,null,null,null,null,null,null,null,null,null,null,null,null,null,null,null,null,null,null,null,null,null,null,null,54.9]
[null,null,null,null,null,null,null,null,null,null,null,null,null,null,null,null,null,null,null,null,null,null,null,null,null,null,null,55]
[null,null,null,null,null,null,null,null,null,null,null,null,null,null,null,null,null,null,null,null,null,null,null,null,null,null,null,55.1]
[null,null,null,null,null,null,null,null,null,null,null,null,null,null,null,null,null,null,null,null,null,null,null,null,null,null,null,55.2]
[null,null,null,null,null,null,null,null,null,null,null,null,null,null,null,null,null,null,null,null,null,null,null,null,null,null,null,55.3]
[null,null,null,null,null,null,null,null,null,null,null,null,null,null,null,null,null,null,null,null,null,null,null,null,null,null,null,55.4]
[null,null,null,null,null,null,null,null,null,null,null,null,null,null,null,null,null,null,null,null,null,null,null,null,null,null,null,55.5]
[null,null,null,null,null,null,null,null,null,null,null,null,null,null,null,null,null,null,null,null,null,null,null,null,null,null,null,55.6]
[null,null,null,null,null,null,null,null,null,null,null,null,null,null,null,null,null,null,null,null,null,null,null,null,null,null,null,55.7]
[null,null,null,null,null,null,null,null,null,null,null,null,null,null,null,null,null,null,null,null,null,null,null,null,null,null,null,55.8]
[null,null,null,null,null,null,null,null,null,null,null,null,null,null,null,null,null,null,null,null,null,null,null,null,null,null,null,55.9]
[null,null,null,null,null,null,null,null,null,null,null,null,null,null,null,null,null,null,null,null,null,null,null,null,null,null,null,56]
[null,null,null,null,null,null,null,null,null,null,null,null,null,null,null,null,null,null,null,null,null,null,null,null,null,null,null,56.1]
[null,null,null,null,null,null,null,null,null,null,null,null,null,null,null,null,null,null,null,null,null,null,null,null,null,null,null,56.2]
[null,null,null,null,null,null,null,null,null,null,null,null,null,null,null,null,null,null,null,null,null,null,null,null,null,null,null,56.3]
[null,null,null,null,null,null,null,null,null,null,null,null,null,null,null,null,null,null,null,null,null,null,null,null,null,null,null,56.4]
[null,null,null,null,null,null,null,null,null,null,null,null,null,null,null,null,null,null,null,null,null,null,null,null,null,null,null,56.5]
[null,null,null,null,null,null,null,null,null,null,null,null,null,null,null,null,null,null,null,null,null,null,null,null,null,null,null,56.6]
[null,null,null,null,null,null,null,null,null,null,null,null,null,null,null,null,null,null,null,null,null,null,null,null,null,null,null,56.7]
[null,null,null,null,null,null,null,null,null,null,null,null,null,null,null,null,null,null,null,null,null,null,null,null,null,null,null,56.8]
[null,null,null,null,null,null,null,null,null,null,null,null,null,null,null,null,null,null,null,null,null,null,null,null,null,null,null,56.9]
[null,null,null,null,null,null,null,null,null,null,null,null,null,null,null,null,null,null,null,null,null,null,null,null,null,null,null,57]
[null,null,null,null,null,null,null,null,null,null,null,null,null,null,null,null,null,null,null,null,null,null,null,null,null,null,null,57.1]
[null,null,null,null,null,null,null,null,null,null,null,null,null,null,null,null,null,null,null,null,null,null,null,null,null,null,null,57.2]
[null,null,null,null,null,null,null,null,null,null,null,null,null,null,null,null,null,null,null,null,null,null,null,null,null,null,null,57.3]
[null,null,null,null,null,null,null,null,null,null,null,null,null,null,null,null,null,null,null,null,null,null,null,null,null,null,null,57.4]
[null,null,null,null,null,null,null,null,null,null,null,null,null,null,null,null,null,null,null,null,null,null,null,null,null,null,null,57.5]
[null,null,null,null,null,null,null,null,null,null,null,null,null,null,null,null,null,null,null,null,null,null,null,null,null,null,null,57.6]
[null,null,null,null,null,null,null,null,null,null,null,null,null,null,null,null,null,null,null,null,null,null,null,null,null,null,null,57.7]
[null,null,null,null,null,null,null,null,null,null,null,null,null,null,null,null,null,null,null,null,null,null,null,null,null,null,null,57.8]
[null,null,null,null,null,null,null,null,null,null,null,null,null,null,null,null,null,null,null,null,null,null,null,null,null,null,null,57.9]
[null,null,null,null,null,null,null,null,null,null,null,null,null,null,null,null,null,null,null,null,null,null,null,null,null,null,null,58]
[null,null,null,null,null,null,null,null,null,null,null,null,null,null,null,null,null,null,null,null,null,null,null,null,null,null,null,58.1]
[null,null,null,null,null,null,null,null,null,null,null,null,null,null,null,null,null,null,null,null,null,null,null,null,null,null,null,58.2]
[null,null,null,null,null,null,null,null,null,null,null,null,null,null,null,null,null,null,null,null,null,null,null,null,null,null,null,58.3]
[null,null,null,null,null,null,null,null,null,null,null,null,null,null,null,null,null,null,null,null,null,null,null,null,null,null,null,58.4]
[null,null,null,null,null,null,null,null,null,null,null,null,null,null,null,null,null,null,null,null,null,null,null,null,null,null,null,58.5]
[null,null,null,null,null,null,null,null,null,null,null,null,null,null,null,null,null,null,null,null,null,null,null,null,null,null,null,58.6]
[null,null,null,null,null,null,null,null,null,null,null,null,null,null,null,null,null,null,null,null,null,null,null,null,null,null,null,58.7]
[null,null,null,null,null,null,null,null,null,null,null,null,null,null,null,null,null,null,null,null,null,null,null,null,null,null,null,58.8]
[null,null,null,null,null,null,null,null,null,null,null,null,null,null,null,null,null,null,null,null,null,null,null,null,null,null,null,58.9]
[null,null,null,null,null,null,null,null,null,null,null,null,null,null,null,null,null,null,null,null,null,null,null,null,null,null,null,59]
[null,null,null,null,null,null,null,null,null,null,null,null,null,null,null,null,null,null,null,null,null,null,null,null,null,null,null,59.1]
[null,null,null,null,null,null,null,null,null,null,null,null,null,null,null,null,null,null,null,null,null,null,null,null,null,null,null,59.2]
[null,null,null,null,null,null,null,null,null,null,null,null,null,null,null,null,null,null,null,null,null,null,null,null,null,null,null,59.3]
[null,null,null,null,null,null,null,null,null,null,null,null,null,null,null,null,null,null,null,null,null,null,null,null,null,null,null,59.4]
[null,null,null,null,null,null,null,null,null,null,null,null,null,null,null,null,null,null,null,null,null,null,null,null,null,null,null,59.5]
[null,null,null,null,null,null,null,null,null,null,null,null,null,null,null,null,null,null,null,null,null,null,null,null,null,null,null,59.6]
[null,null,null,null,null,null,null,null,null,null,null,null,null,null,null,null,null,null,null,null,null,null,null,null,null,null,null,59.7]
[null,null,null,null,null,null,null,null,null,null,null,null,null,null,null,null,null,null,null,null,null,null,null,null,null,null,null,59.8]
[null,null,null,null,null,null,null,null,null,null,null,null,null,null,null,null,null,null,null,null,null,null,null,null,null,null,null,59.9]
[null,null,null,null,null,null,null,null,null,null,null,null,null,null,null,null,null,null,null,null,null,null,null,null,null,null,null,60]
[null,null,null,null,null,null,null,null,null,null,null,null,null,null,null,null,null,null,null,null,null,null,null,null,null,null,null,60.1]
[null,null,null,null,null,null,null,null,null,null,null,null,null,null,null,null,null,null,null,null,null,null,null,null,null,null,null,60.2]
[null,null,null,null,null,null,null,null,null,null,null,null,null,null,null,null,null,null,null,null,null,null,null,null,null,null,null,60.3]
[null,null,null,null,null,null,null,null,null,null,null,null,null,null,null,null,null,null,null,null,null,null,null,null,null,null,null,60.4]
[null,null,null,null,null,null,null,null,null,null,null,null,null,null,null,null,null,null,null,null,null,null,null,null,null,null,null,60.5]
[null,null,null,null,null,null,null,null,null,null,null,null,null,null,null,null,null,null,null,null,null,null,null,null,null,null,null,60.6]
[null,null,null,null,null,null,null,null,null,null,null,null,null,null,null,null,null,null,null,null,null,null,null,null,null,null,null,60.7]
[null,null,null,null,null,null,null,null,null,null,null,null,null,null,null,null,null,null,null,null,null,null,null,null,null,null,null,60.8]
[null,null,null,null,null,null,null,null,null,null,null,null,null,null,null,null,null,null,null,null,null,null,null,null,null,null,null,60.9]
[null,null,null,null,null,null,null,null,null,null,null,null,null,null,null,null,null,null,null,null,null,null,null,null,null,null,null,61]
[null,null,null,null,null,null,null,null,null,null,null,null,null,null,null,null,null,null,null,null,null,null,null,null,null,null,null,61.1]
[null,null,null,null,null,null,null,null,null,null,null,null,null,null,null,null,null,null,null,null,null,null,null,null,null,null,null,61.2]
[null,null,null,null,null,null,null,null,null,null,null,null,null,null,null,null,null,null,null,null,null,null,null,null,null,null,null,61.3]
[null,null,null,null,null,null,null,null,null,null,null,null,null,null,null,null,null,null,null,null,null,null,null,null,null,null,null,61.4]
[null,null,null,null,null,null,null,null,null,null,null,null,null,null,null,null,null,null,null,null,null,null,null,null,null,null,null,61.5]
[null,null,null,null,null,null,null,null,null,null,null,null,null,null,null,null,null,null,null,null,null,null,null,null,null,null,null,61.6]
[null,null,null,null,null,null,null,null,null,null,null,null,null,null,null,null,null,null,null,null,null,null,null,null,null,null,null,61.7]
[null,null,null,null,null,null,null,null,null,null,null,null,null,null,null,null,null,null,null,null,null,null,null,null,null,null,null,61.8]
[null,null,null,null,null,null,null,null,null,null,null,null,null,null,null,null,null,null,null,null,null,null,null,null,null,null,null,61.9]
[null,null,null,null,null,null,null,null,null,null,null,null,null,null,null,null,null,null,null,null,null,null,null,null,null,null,null,62]
[null,null,null,null,null,null,null,null,null,null,null,null,null,null,null,null,null,null,null,null,null,null,null,null,null,null,null,62.1]
[null,null,null,null,null,null,null,null,null,null,null,null,null,null,null,null,null,null,null,null,null,null,null,null,null,null,null,62.2]
[null,null,null,null,null,null,null,null,null,null,null,null,null,null,null,null,null,null,null,null,null,null,null,null,null,null,null,62.3]
[null,null,null,null,null,null,null,null,null,null,null,null,null,null,null,null,null,null,null,null,null,null,null,null,null,null,null,62.4]
[null,null,null,null,null,null,null,null,null,null,null,null,null,null,null,null,null,null,null,null,null,null,null,null,null,null,null,62.5]
[null,null,null,null,null,null,null,null,null,null,null,null,null,null,null,null,null,null,null,null,null,null,null,null,null,null,null,62.6]
[null,null,null,null,null,null,null,null,null,null,null,null,null,null,null,null,null,null,null,null,null,null,null,null,null,null,null,62.7]
[null,null,null,null,null,null,null,null,null,null,null,null,null,null,null,null,null,null,null,null,null,null,null,null,null,null,null,62.8]
[null,null,null,null,null,null,null,null,null,null,null,null,null,null,null,null,null,null,null,null,null,null,null,null,null,null,null,62.9]
[null,null,null,null,null,null,null,null,null,null,null,null,null,null,null,null,null,null,null,null,null,null,null,null,null,null,null,63]
[null,null,null,null,null,null,null,null,null,null,null,null,null,null,null,null,null,null,null,null,null,null,null,null,null,null,null,63.1]
[null,null,null,null,null,null,null,null,null,null,null,null,null,null,null,null,null,null,null,null,null,null,null,null,null,null,null,63.2]
[null,null,null,null,null,null,null,null,null,null,null,null,null,null,null,null,null,null,null,null,null,null,null,null,null,null,null,63.3]
[null,null,null,null,null,null,null,null,null,null,null,null,null,null,null,null,null,null,null,null,null,null,null,null,null,null,null,63.4]
[null,null,null,null,null,null,null,null,null,null,null,null,null,null,null,null,null,null,null,null,null,null,null,null,null,null,null,63.5]
[null,null,null,null,null,null,null,null,null,null,null,null,null,null,null,null,null,null,null,null,null,null,null,null,null,null,null,63.6]
[null,null,null,null,null,null,null,null,null,null,null,null,null,null,null,null,null,null,null,null,null,null,null,null,null,null,null,63.7]
[null,null,null,null,null,null,null,null,null,null,null,null,null,null,null,null,null,null,null,null,null,null,null,null,null,null,null,63.8]
[null,null,null,null,null,null,null,null,null,null,null,null,null,null,null,null,null,null,null,null,null,null,null,null,null,null,null,63.9]
[null,null,null,null,null,null,null,null,null,null,null,null,null,null,null,null,null,null,null,null,null,null,null,null,null,null,null,64]
[null,null,null,null,null,null,null,null,null,null,null,null,null,null,null,null,null,null,null,null,null,null,null,null,null,null,null,64.099999999999994]
[null,null,null,null,null,null,null,null,null,null,null,null,null,null,null,null,null,null,null,null,null,null,null,null,null,null,null,64.2]
[null,null,null,null,null,null,null,null,null,null,null,null,null,null,null,null,null,null,null,null,null,null,null,null,null,null,null,64.3]
[null,null,null,null,null,null,null,null,null,null,null,null,null,null,null,null,null,null,null,null,null,null,null,null,null,null,null,64.400000000000006]
[null,null,null,null,null,null,null,null,null,null,null,null,null,null,null,null,null,null,null,null,null,null,null,null,null,null,null,64.5]
[null,null,null,null,null,null,null,null,null,null,null,null,null,null,null,null,null,null,null,null,null,null,null,null,null,null,null,64.599999999999994]
[null,null,null,null,null,null,null,null,null,null,null,null,null,null,null,null,null,null,null,null,null,null,null,null,null,null,null,64.7]
[null,null,null,null,null,null,null,null,null,null,null,null,null,null,null,null,null,null,null,null,null,null,null,null,null,null,null,64.8]
[null,null,null,null,null,null,null,null,null,null,null,null,null,null,null,null,null,null,null,null,null,null,null,null,null,null,null,64.900000000000006]
[null,null,null,null,null,null,null,null,null,null,null,null,null,null,null,null,null,null,null,null,null,null,null,null,null,null,null,65]
[null,null,null,null,null,null,null,null,null,null,null,null,null,null,null,null,null,null,null,null,null,null,null,null,null,null,null,65.099999999999994]
[null,null,null,null,null,null,null,null,null,null,null,null,null,null,null,null,null,null,null,null,null,null,null,null,null,null,null,65.2]
[null,null,null,null,null,null,null,null,null,null,null,null,null,null,null,null,null,null,null,null,null,null,null,null,null,null,null,65.3]
[null,null,null,null,null,null,null,null,null,null,null,null,null,null,null,null,null,null,null,null,null,null,null,null,null,null,null,65.400000000000006]
[null,null,null,null,null,null,null,null,null,null,null,null,null,null,null,null,null,null,null,null,null,null,null,null,null,null,null,65.5]
[null,null,null,null,null,null,null,null,null,null,null,null,null,null,null,null,null,null,null,null,null,null,null,null,null,null,null,65.599999999999994]
[null,null,null,null,null,null,null,null,null,null,null,null,null,null,null,null,null,null,null,null,null,null,null,null,null,null,null,65.7]
[null,null,null,null,null,null,null,null,null,null,null,null,null,null,null,null,null,null,null,null,null,null,null,null,null,null,null,65.8]
[null,null,null,null,null,null,null,null,null,null,null,null,null,null,null,null,null,null,null,null,null,null,null,null,null,null,null,65.900000000000006]
[null,null,null,null,null,null,null,null,null,null,null,null,null,null,null,null,null,null,null,null,null,null,null,null,null,null,null,66]
[null,null,null,null,null,null,null,null,null,null,null,null,null,null,null,null,null,null,null,null,null,null,null,null,null,null,null,66.099999999999994]
[null,null,null,null,null,null,null,null,null,null,null,null,null,null,null,null,null,null,null,null,null,null,null,null,null,null,null,66.2]
[null,null,null,null,null,null,null,null,null,null,null,null,null,null,null,null,null,null,null,null,null,null,null,null,null,null,null,66.3]
[null,null,null,null,null,null,null,null,null,null,null,null,null,null,null,null,null,null,null,null,null,null,null,null,null,null,null,66.400000000000006]
[null,null,null,null,null,null,null,null,null,null,null,null,null,null,null,null,null,null,null,null,null,null,null,null,null,null,null,66.5]
[null,null,null,null,null,null,null,null,null,null,null,null,null,null,null,null,null,null,null,null,null,null,null,null,null,null,null,66.599999999999994]
[null,null,null,null,null,null,null,null,null,null,null,null,null,null,null,null,null,null,null,null,null,null,null,null,null,null,null,66.7]
[null,null,null,null,null,null,null,null,null,null,null,null,null,null,null,null,null,null,null,null,null,null,null,null,null,null,null,66.8]
[null,null,null,null,null,null,null,null,null,null,null,null,null,null,null,null,null,null,null,null,null,null,null,null,null,null,null,66.900000000000006]
[null,null,null,null,null,null,null,null,null,null,null,null,null,null,null,null,null,null,null,null,null,null,null,null,null,null,null,67]
[null,null,null,null,null,null,null,null,null,null,null,null,null,null,null,null,null,null,null,null,null,null,null,null,null,null,null,67.099999999999994]
[null,null,null,null,null,null,null,null,null,null,null,null,null,null,null,null,null,null,null,null,null,null,null,null,null,null,null,67.2]
[null,null,null,null,null,null,null,null,null,null,null,null,null,null,null,null,null,null,null,null,null,null,null,null,null,null,null,67.3]
[null,null,null,null,null,null,null,null,null,null,null,null,null,null,null,null,null,null,null,null,null,null,null,null,null,null,null,67.400000000000006]
[null,null,null,null,null,null,null,null,null,null,null,null,null,null,null,null,null,null,null,null,null,null,null,null,null,null,null,67.5]
[null,null,null,null,null,null,null,null,null,null,null,null,null,null,null,null,null,null,null,null,null,null,null,null,null,null,null,67.599999999999994]
[null,null,null,null,null,null,null,null,null,null,null,null,null,null,null,null,null,null,null,null,null,null,null,null,null,null,null,67.7]
[null,null,null,null,null,null,null,null,null,null,null,null,null,null,null,null,null,null,null,null,null,null,null,null,null,null,null,67.8]
[null,null,null,null,null,null,null,null,null,null,null,null,null,null,null,null,null,null,null,null,null,null,null,null,null,null,null,67.900000000000006]
[null,null,null,null,null,null,null,null,null,null,null,null,null,null,null,null,null,null,null,null,null,null,null,null,null,null,null,68]
[null,null,null,null,null,null,null,null,null,null,null,null,null,null,null,null,null,null,null,null,null,null,null,null,null,null,null,68.099999999999994]
[null,null,null,null,null,null,null,null,null,null,null,null,null,null,null,null,null,null,null,null,null,null,null,null,null,null,null,68.2]
[null,null,null,null,null,null,null,null,null,null,null,null,null,null,null,null,null,null,null,null,null,null,null,null,null,null,null,68.3]
[null,null,null,null,null,null,null,null,null,null,null,null,null,null,null,null,null,null,null,null,null,null,null,null,null,null,null,68.400000000000006]
[null,null,null,null,null,null,null,null,null,null,null,null,null,null,null,null,null,null,null,null,null,null,null,null,null,null,null,68.5]
[null,null,null,null,null,null,null,null,null,null,null,null,null,null,null,null,null,null,null,null,null,null,null,null,null,null,null,68.599999999999994]
[null,null,null,null,null,null,null,null,null,null,null,null,null,null,null,null,null,null,null,null,null,null,null,null,null,null,null,68.7]
[null,null,null,null,null,null,null,null,null,null,null,null,null,null,null,null,null,null,null,null,null,null,null,null,null,null,null,68.8]
[null,null,null,null,null,null,null,null,null,null,null,null,null,null,null,null,null,null,null,null,null,null,null,null,null,null,null,68.900000000000006]
[null,null,null,null,null,null,null,null,null,null,null,null,null,null,null,null,null,null,null,null,null,null,null,null,null,null,null,69]
[null,null,null,null,null,null,null,null,null,null,null,null,null,null,null,null,null,null,null,null,null,null,null,null,null,null,null,69.099999999999994]
[null,null,null,null,null,null,null,null,null,null,null,null,null,null,null,null,null,null,null,null,null,null,null,null,null,null,null,69.2]
[null,null,null,null,null,null,null,null,null,null,null,null,null,null,null,null,null,null,null,null,null,null,null,null,null,null,null,69.3]
[null,null,null,null,null,null,null,null,null,null,null,null,null,null,null,null,null,null,null,null,null,null,null,null,null,null,null,69.400000000000006]
[null,null,null,null,null,null,null,null,null,null,null,null,null,null,null,null,null,null,null,null,null,null,null,null,null,null,null,69.5]
[null,null,null,null,null,null,null,null,null,null,null,null,null,null,null,null,null,null,null,null,null,null,null,null,null,null,null,69.599999999999994]
[null,null,null,null,null,null,null,null,null,null,null,null,null,null,null,null,null,null,null,null,null,null,null,null,null,null,null,69.7]
[null,null,null,null,null,null,null,null,null,null,null,null,null,null,null,null,null,null,null,null,null,null,null,null,null,null,null,69.8]
[null,null,null,null,null,null,null,null,null,null,null,null,null,null,null,null,null,null,null,null,null,null,null,null,null,null,null,69.900000000000006]
[null,null,null,null,null,null,null,null,null,null,null,null,null,null,null,null,null,null,null,null,null,null,null,null,null,null,null,70]
[null,null,null,null,null,null,null,null,null,null,null,null,null,null,null,null,null,null,null,null,null,null,null,null,null,null,null,70.099999999999994]
[null,null,null,null,null,null,null,null,null,null,null,null,null,null,null,null,null,null,null,null,null,null,null,null,null,null,null,70.2]
[null,null,null,null,null,null,null,null,null,null,null,null,null,null,null,null,null,null,null,null,null,null,null,null,null,null,null,70.3]
[null,null,null,null,null,null,null,null,null,null,null,null,null,null,null,null,null,null,null,null,null,null,null,null,null,null,null,70.400000000000006]
[null,null,null,null,null,null,null,null,null,null,null,null,null,null,null,null,null,null,null,null,null,null,null,null,null,null,null,70.5]
[null,null,null,null,null,null,null,null,null,null,null,null,null,null,null,null,null,null,null,null,null,null,null,null,null,null,null,70.599999999999994]
[null,null,null,null,null,null,null,null,null,null,null,null,null,null,null,null,null,null,null,null,null,null,null,null,null,null,null,70.7]
[null,null,null,null,null,null,null,null,null,null,null,null,null,null,null,null,null,null,null,null,null,null,null,null,null,null,null,70.8]
[null,null,null,null,null,null,null,null,null,null,null,null,null,null,null,null,null,null,null,null,null,null,null,null,null,null,null,70.900000000000006]
[null,null,null,null,null,null,null,null,null,null,null,null,null,null,null,null,null,null,null,null,null,null,null,null,null,null,null,71]
[null,null,null,null,null,null,null,null,null,null,null,null,null,null,null,null,null,null,null,null,null,null,null,null,null,null,null,71.099999999999994]
[null,null,null,null,null,null,null,null,null,null,null,null,null,null,null,null,null,null,null,null,null,null,null,null,null,null,null,71.2]
[null,null,null,null,null,null,null,null,null,null,null,null,null,null,null,null,null,null,null,null,null,null,null,null,null,null,null,71.3]
[null,null,null,null,null,null,null,null,null,null,null,null,null,null,null,null,null,null,null,null,null,null,null,null,null,null,null,71.400000000000006]
[null,null,null,null,null,null,null,null,null,null,null,null,null,null,null,null,null,null,null,null,null,null,null,null,null,null,null,71.5]
[null,null,null,null,null,null,null,null,null,null,null,null,null,null,null,null,null,null,null,null,null,null,null,null,null,null,null,71.599999999999994]
[null,null,null,null,null,null,null,null,null,null,null,null,null,null,null,null,null,null,null,null,null,null,null,null,null,null,null,71.7]
[null,null,null,null,null,null,null,null,null,null,null,null,null,null,null,null,null,null,null,null,null,null,null,null,null,null,null,71.8]
[null,null,null,null,null,null,null,null,null,null,null,null,null,null,null,null,null,null,null,null,null,null,null,null,null,null,null,71.900000000000006]
[null,null,null,null,null,null,null,null,null,null,null,null,null,null,null,null,null,null,null,null,null,null,null,null,null,null,null,72]
[null,null,null,null,null,null,null,null,null,null,null,null,null,null,null,null,null,null,null,null,null,null,null,null,null,null,null,72.099999999999994]
[null,null,null,null,null,null,null,null,null,null,null,null,null,null,null,null,null,null,null,null,null,null,null,null,null,null,null,72.2]
[null,null,null,null,null,null,null,null,null,null,null,null,null,null,null,null,null,null,null,null,null,null,null,null,null,null,null,72.3]
[null,null,null,null,null,null,null,null,null,null,null,null,null,null,null,null,null,null,null,null,null,null,null,null,null,null,null,72.400000000000006]
[null,null,null,null,null,null,null,null,null,null,null,null,null,null,null,null,null,null,null,null,null,null,null,null,null,null,null,72.5]
[null,null,null,null,null,null,null,null,null,null,null,null,null,null,null,null,null,null,null,null,null,null,null,null,null,null,null,72.599999999999994]
[null,null,null,null,null,null,null,null,null,null,null,null,null,null,null,null,null,null,null,null,null,null,null,null,null,null,null,72.7]
[null,null,null,null,null,null,null,null,null,null,null,null,null,null,null,null,null,null,null,null,null,null,null,null,null,null,null,72.8]
[null,null,null,null,null,null,null,null,null,null,null,null,null,null,null,null,null,null,null,null,null,null,null,null,null,null,null,72.900000000000006]
[null,null,null,null,null,null,null,null,null,null,null,null,null,null,null,null,null,null,null,null,null,null,null,null,null,null,null,73]
[null,null,null,null,null,null,null,null,null,null,null,null,null,null,null,null,null,null,null,null,null,null,null,null,null,null,null,73.099999999999994]
[null,null,null,null,null,null,null,null,null,null,null,null,null,null,null,null,null,null,null,null,null,null,null,null,null,null,null,73.2]
[null,null,null,null,null,null,null,null,null,null,null,null,null,null,null,null,null,null,null,null,null,null,null,null,null,null,null,73.3]
[null,null,null,null,null,null,null,null,null,null,null,null,null,null,null,null,null,null,null,null,null,null,null,null,null,null,null,73.400000000000006]
[null,null,null,null,null,null,null,null,null,null,null,null,null,null,null,null,null,null,null,null,null,null,null,null,null,null,null,73.5]
[null,null,null,null,null,null,null,null,null,null,null,null,null,null,null,null,null,null,null,null,null,null,null,null,null,null,null,73.599999999999994]
[null,null,null,null,null,null,null,null,null,null,null,null,null,null,null,null,null,null,null,null,null,null,null,null,null,null,null,73.7]
[null,null,null,null,null,null,null,null,null,null,null,null,null,null,null,null,null,null,null,null,null,null,null,null,null,null,null,73.8]
[null,null,null,null,null,null,null,null,null,null,null,null,null,null,null,null,null,null,null,null,null,null,null,null,null,null,null,73.900000000000006]
[null,null,null,null,null,null,null,null,null,null,null,null,null,null,null,null,null,null,null,null,null,null,null,null,null,null,null,74]
[null,null,null,null,null,null,null,null,null,null,null,null,null,null,null,null,null,null,null,null,null,null,null,null,null,null,null,74.099999999999994]
[null,null,null,null,null,null,null,null,null,null,null,null,null,null,null,null,null,null,null,null,null,null,null,null,null,null,null,74.2]
[null,null,null,null,null,null,null,null,null,null,null,null,null,null,null,null,null,null,null,null,null,null,null,null,null,null,null,74.3]
[null,null,null,null,null,null,null,null,null,null,null,null,null,null,null,null,null,null,null,null,null,null,null,null,null,null,null,74.400000000000006]
[null,null,null,null,null,null,null,null,null,null,null,null,null,null,null,null,null,null,null,null,null,null,null,null,null,null,null,74.5]
[null,null,null,null,null,null,null,null,null,null,null,null,null,null,null,null,null,null,null,null,null,null,null,null,null,null,null,74.599999999999994]
[null,null,null,null,null,null,null,null,null,null,null,null,null,null,null,null,null,null,null,null,null,null,null,null,null,null,null,74.7]
[null,null,null,null,null,null,null,null,null,null,null,null,null,null,null,null,null,null,null,null,null,null,null,null,null,null,null,74.8]
[null,null,null,null,null,null,null,null,null,null,null,null,null,null,null,null,null,null,null,null,null,null,null,null,null,null,null,74.900000000000006]
[null,null,null,null,null,null,null,null,null,null,null,null,null,null,null,null,null,null,null,null,null,null,null,null,null,null,null,75]
[null,null,null,null,null,null,null,null,null,null,null,null,null,null,null,null,null,null,null,null,null,null,null,null,null,null,null,75.099999999999994]
[null,null,null,null,null,null,null,null,null,null,null,null,null,null,null,null,null,null,null,null,null,null,null,null,null,null,null,75.2]
[null,null,null,null,null,null,null,null,null,null,null,null,null,null,null,null,null,null,null,null,null,null,null,null,null,null,null,75.3]
[null,null,null,null,null,null,null,null,null,null,null,null,null,null,null,null,null,null,null,null,null,null,null,null,null,null,null,75.400000000000006]
[null,null,null,null,null,null,null,null,null,null,null,null,null,null,null,null,null,null,null,null,null,null,null,null,null,null,null,75.5]
[null,null,null,null,null,null,null,null,null,null,null,null,null,null,null,null,null,null,null,null,null,null,null,null,null,null,null,75.599999999999994]
[null,null,null,null,null,null,null,null,null,null,null,null,null,null,null,null,null,null,null,null,null,null,null,null,null,null,null,75.7]
[null,null,null,null,null,null,null,null,null,null,null,null,null,null,null,null,null,null,null,null,null,null,null,null,null,null,null,75.8]
[null,null,null,null,null,null,null,null,null,null,null,null,null,null,null,null,null,null,null,null,null,null,null,null,null,null,null,75.900000000000006]
[null,null,null,null,null,null,null,null,null,null,null,null,null,null,null,null,null,null,null,null,null,null,null,null,null,null,null,76]
[null,null,null,null,null,null,null,null,null,null,null,null,null,null,null,null,null,null,null,null,null,null,null,null,null,null,null,76.099999999999994]
[null,null,null,null,null,null,null,null,null,null,null,null,null,null,null,null,null,null,null,null,null,null,null,null,null,null,null,76.2]
[null,null,null,null,null,null,null,null,null,null,null,null,null,null,null,null,null,null,null,null,null,null,null,null,null,null,null,76.3]
[null,null,null,null,null,null,null,null,null,null,null,null,null,null,null,null,null,null,null,null,null,null,null,null,null,null,null,76.400000000000006]
[null,null,null,null,null,null,null,null,null,null,null,null,null,null,null,null,null,null,null,null,null,null,null,null,null,null,null,76.5]
[null,null,null,null,null,null,null,null,null,null,null,null,null,null,null,null,null,null,null,null,null,null,null,null,null,null,null,76.599999999999994]
[null,null,null,null,null,null,null,null,null,null,null,null,null,null,null,null,null,null,null,null,null,null,null,null,null,null,null,76.7]
[null,null,null,null,null,null,null,null,null,null,null,null,null,null,null,null,null,null,null,null,null,null,null,null,null,null,null,76.8]
[null,null,null,null,null,null,null,null,null,null,null,null,null,null,null,null,null,null,null,null,null,null,null,null,null,null,null,76.900000000000006]
[null,null,null,null,null,null,null,null,null,null,null,null,null,null,null,null,null,null,null,null,null,null,null,null,null,null,null,77]
[null,null,null,null,null,null,null,null,null,null,null,null,null,null,null,null,null,null,null,null,null,null,null,null,null,null,null,77.099999999999994]
[null,null,null,null,null,null,null,null,null,null,null,null,null,null,null,null,null,null,null,null,null,null,null,null,null,null,null,77.2]
[null,null,null,null,null,null,null,null,null,null,null,null,null,null,null,null,null,null,null,null,null,null,null,null,null,null,null,77.3]
[null,null,null,null,null,null,null,null,null,null,null,null,null,null,null,null,null,null,null,null,null,null,null,null,null,null,null,77.400000000000006]
[null,null,null,null,null,null,null,null,null,null,null,null,null,null,null,null,null,null,null,null,null,null,null,null,null,null,null,77.5]
[null,null,null,null,null,null,null,null,null,null,null,null,null,null,null,null,null,null,null,null,null,null,null,null,null,null,null,77.599999999999994]
[null,null,null,null,null,null,null,null,null,null,null,null,null,null,null,null,null,null,null,null,null,null,null,null,null,null,null,77.7]
[null,null,null,null,null,null,null,null,null,null,null,null,null,null,null,null,null,null,null,null,null,null,null,null,null,null,null,77.8]
[null,null,null,null,null,null,null,null,null,null,null,null,null,null,null,null,null,null,null,null,null,null,null,null,null,null,null,77.900000000000006]
[null,null,null,null,null,null,null,null,null,null,null,null,null,null,null,null,null,null,null,null,null,null,null,null,null,null,null,78]
[null,null,null,null,null,null,null,null,null,null,null,null,null,null,null,null,null,null,null,null,null,null,null,null,null,null,null,78.099999999999994]
[null,null,null,null,null,null,null,null,null,null,null,null,null,null,null,null,null,null,null,null,null,null,null,null,null,null,null,78.2]
[null,null,null,null,null,null,null,null,null,null,null,null,null,null,null,null,null,null,null,null,null,null,null,null,null,null,null,78.3]
[null,null,null,null,null,null,null,null,null,null,null,null,null,null,null,null,null,null,null,null,null,null,null,null,null,null,null,78.400000000000006]
[null,null,null,null,null,null,null,null,null,null,null,null,null,null,null,null,null,null,null,null,null,null,null,null,null,null,null,78.5]
[null,null,null,null,null,null,null,null,null,null,null,null,null,null,null,null,null,null,null,null,null,null,null,null,null,null,null,78.599999999999994]
[null,null,null,null,null,null,null,null,null,null,null,null,null,null,null,null,null,null,null,null,null,null,null,null,null,null,null,78.7]
[null,null,null,null,null,null,null,null,null,null,null,null,null,null,null,null,null,null,null,null,null,null,null,null,null,null,null,78.8]
[null,null,null,null,null,null,null,null,null,null,null,null,null,null,null,null,null,null,null,null,null,null,null,null,null,null,null,78.900000000000006]
[null,null,null,null,null,null,null,null,null,null,null,null,null,null,null,null,null,null,null,null,null,null,null,null,null,null,null,79]
[null,null,null,null,null,null,null,null,null,null,null,null,null,null,null,null,null,null,null,null,null,null,null,null,null,null,null,79.099999999999994]
[null,null,null,null,null,null,null,null,null,null,null,null,null,null,null,null,null,null,null,null,null,null,null,null,null,null,null,79.2]
[null,null,null,null,null,null,null,null,null,null,null,null,null,null,null,null,null,null,null,null,null,null,null,null,null,null,null,79.3]
[null,null,null,null,null,null,null,null,null,null,null,null,null,null,null,null,null,null,null,null,null,null,null,null,null,null,null,79.400000000000006]
[null,null,null,null,null,null,null,null,null,null,null,null,null,null,null,null,null,null,null,null,null,null,null,null,null,null,null,79.5]
[null,null,null,null,null,null,null,null,null,null,null,null,null,null,null,null,null,null,null,null,null,null,null,null,null,null,null,79.599999999999994]
[null,null,null,null,null,null,null,null,null,null,null,null,null,null,null,null,null,null,null,null,null,null,null,null,null,null,null,79.7]
[null,null,null,null,null,null,null,null,null,null,null,null,null,null,null,null,null,null,null,null,null,null,null,null,null,null,null,79.8]
[null,null,null,null,null,null,null,null,null,null,null,null,null,null,null,null,null,null,null,null,null,null,null,null,null,null,null,79.900000000000006]
[null,null,null,null,null,null,null,null,null,null,null,null,null,null,null,null,null,null,null,null,null,null,null,null,null,null,null,80]
[null,null,null,null,null,null,null,null,null,null,null,null,null,null,null,null,null,null,null,null,null,null,null,null,null,null,null,80.099999999999994]
[null,null,null,null,null,null,null,null,null,null,null,null,null,null,null,null,null,null,null,null,null,null,null,null,null,null,null,80.2]
[null,null,null,null,null,null,null,null,null,null,null,null,null,null,null,null,null,null,null,null,null,null,null,null,null,null,null,80.3]
[null,null,null,null,null,null,null,null,null,null,null,null,null,null,null,null,null,null,null,null,null,null,null,null,null,null,null,80.400000000000006]
[null,null,null,null,null,null,null,null,null,null,null,null,null,null,null,null,null,null,null,null,null,null,null,null,null,null,null,80.5]
[null,null,null,null,null,null,null,null,null,null,null,null,null,null,null,null,null,null,null,null,null,null,null,null,null,null,null,80.599999999999994]
[null,null,null,null,null,null,null,null,null,null,null,null,null,null,null,null,null,null,null,null,null,null,null,null,null,null,null,80.7]
[null,null,null,null,null,null,null,null,null,null,null,null,null,null,null,null,null,null,null,null,null,null,null,null,null,null,null,80.8]
[null,null,null,null,null,null,null,null,null,null,null,null,null,null,null,null,null,null,null,null,null,null,null,null,null,null,null,80.900000000000006]
[null,null,null,null,null,null,null,null,null,null,null,null,null,null,null,null,null,null,null,null,null,null,null,null,null,null,null,81]
[null,null,null,null,null,null,null,null,null,null,null,null,null,null,null,null,null,null,null,null,null,null,null,null,null,null,null,81.099999999999994]
[null,null,null,null,null,null,null,null,null,null,null,null,null,null,null,null,null,null,null,null,null,null,null,null,null,null,null,81.2]
[null,null,null,null,null,null,null,null,null,null,null,null,null,null,null,null,null,null,null,null,null,null,null,null,null,null,null,81.3]
[null,null,null,null,null,null,null,null,null,null,null,null,null,null,null,null,null,null,null,null,null,null,null,null,null,null,null,81.400000000000006]
[null,null,null,null,null,null,null,null,null,null,null,null,null,null,null,null,null,null,null,null,null,null,null,null,null,null,null,81.5]
[null,null,null,null,null,null,null,null,null,null,null,null,null,null,null,null,null,null,null,null,null,null,null,null,null,null,null,81.599999999999994]
[null,null,null,null,null,null,null,null,null,null,null,null,null,null,null,null,null,null,null,null,null,null,null,null,null,null,null,81.7]
[null,null,null,null,null,null,null,null,null,null,null,null,null,null,null,null,null,null,null,null,null,null,null,null,null,null,null,81.8]
[null,null,null,null,null,null,null,null,null,null,null,null,null,null,null,null,null,null,null,null,null,null,null,null,null,null,null,81.900000000000006]
[null,null,null,null,null,null,null,null,null,null,null,null,null,null,null,null,null,null,null,null,null,null,null,null,null,null,null,82]
[null,null,null,null,null,null,null,null,null,null,null,null,null,null,null,null,null,null,null,null,null,null,null,null,null,null,null,82.1]
[null,null,null,null,null,null,null,null,null,null,null,null,null,null,null,null,null,null,null,null,null,null,null,null,null,null,null,82.2]
[null,null,null,null,null,null,null,null,null,null,null,null,null,null,null,null,null,null,null,null,null,null,null,null,null,null,null,82.3]
[null,null,null,null,null,null,null,null,null,null,null,null,null,null,null,null,null,null,null,null,null,null,null,null,null,null,null,82.4]
[null,null,null,null,null,null,null,null,null,null,null,null,null,null,null,null,null,null,null,null,null,null,null,null,null,null,null,82.5]
[null,null,null,null,null,null,null,null,null,null,null,null,null,null,null,null,null,null,null,null,null,null,null,null,null,null,null,82.6]
[null,null,null,null,null,null,null,null,null,null,null,null,null,null,null,null,null,null,null,null,null,null,null,null,null,null,null,82.7]
[null,null,null,null,null,null,null,null,null,null,null,null,null,null,null,null,null,null,null,null,null,null,null,null,null,null,null,82.8]
[null,null,null,null,null,null,null,null,null,null,null,null,null,null,null,null,null,null,null,null,null,null,null,null,null,null,null,82.9]
[null,null,null,null,null,null,null,null,null,null,null,null,null,null,null,null,null,null,null,null,null,null,null,null,null,null,null,83]
[null,null,null,null,null,null,null,null,null,null,null,null,null,null,null,null,null,null,null,null,null,null,null,null,null,null,null,83.1]
[null,null,null,null,null,null,null,null,null,null,null,null,null,null,null,null,null,null,null,null,null,null,null,null,null,null,null,83.2]
[null,null,null,null,null,null,null,null,null,null,null,null,null,null,null,null,null,null,null,null,null,null,null,null,null,null,null,83.3]
[null,null,null,null,null,null,null,null,null,null,null,null,null,null,null,null,null,null,null,null,null,null,null,null,null,null,null,83.4]
[null,null,null,null,null,null,null,null,null,null,null,null,null,null,null,null,null,null,null,null,null,null,null,null,null,null,null,83.5]
[null,null,null,null,null,null,null,null,null,null,null,null,null,null,null,null,null,null,null,null,null,null,null,null,null,null,null,83.6]
[null,null,null,null,null,null,null,null,null,null,null,null,null,null,null,null,null,null,null,null,null,null,null,null,null,null,null,83.7]
[null,null,null,null,null,null,null,null,null,null,null,null,null,null,null,null,null,null,null,null,null,null,null,null,null,null,null,83.8]
[null,null,null,null,null,null,null,null,null,null,null,null,null,null,null,null,null,null,null,null,null,null,null,null,null,null,null,83.9]
[null,null,null,null,null,null,null,null,null,null,null,null,null,null,null,null,null,null,null,null,null,null,null,null,null,null,null,84]
[null,null,null,null,null,null,null,null,null,null,null,null,null,null,null,null,null,null,null,null,null,null,null,null,null,null,null,84.1]
[null,null,null,null,null,null,null,null,null,null,null,null,null,null,null,null,null,null,null,null,null,null,null,null,null,null,null,84.2]
[null,null,null,null,null,null,null,null,null,null,null,null,null,null,null,null,null,null,null,null,null,null,null,null,null,null,null,84.3]
[null,null,null,null,null,null,null,null,null,null,null,null,null,null,null,null,null,null,null,null,null,null,null,null,null,null,null,84.4]
[null,null,null,null,null,null,null,null,null,null,null,null,null,null,null,null,null,null,null,null,null,null,null,null,null,null,null,84.5]
[null,null,null,null,null,null,null,null,null,null,null,null,null,null,null,null,null,null,null,null,null,null,null,null,null,null,null,84.6]
[null,null,null,null,null,null,null,null,null,null,null,null,null,null,null,null,null,null,null,null,null,null,null,null,null,null,null,84.7]
[null,null,null,null,null,null,null,null,null,null,null,null,null,null,null,null,null,null,null,null,null,null,null,null,null,null,null,84.8]
[null,null,null,null,null,null,null,null,null,null,null,null,null,null,null,null,null,null,null,null,null,null,null,null,null,null,null,84.9]
[null,null,null,null,null,null,null,null,null,null,null,null,null,null,null,null,null,null,null,null,null,null,null,null,null,null,null,85]
[null,null,null,null,null,null,null,null,null,null,null,null,null,null,null,null,null,null,null,null,null,null,null,null,null,null,null,85.1]
[null,null,null,null,null,null,null,null,null,null,null,null,null,null,null,null,null,null,null,null,null,null,null,null,null,null,null,85.2]
[null,null,null,null,null,null,null,null,null,null,null,null,null,null,null,null,null,null,null,null,null,null,null,null,null,null,null,85.3]
[null,null,null,null,null,null,null,null,null,null,null,null,null,null,null,null,null,null,null,null,null,null,null,null,null,null,null,85.4]
[null,null,null,null,null,null,null,null,null,null,null,null,null,null,null,null,null,null,null,null,null,null,null,null,null,null,null,85.5]
[null,null,null,null,null,null,null,null,null,null,null,null,null,null,null,null,null,null,null,null,null,null,null,null,null,null,null,85.6]
[null,null,null,null,null,null,null,null,null,null,null,null,null,null,null,null,null,null,null,null,null,null,null,null,null,null,null,85.7]
[null,null,null,null,null,null,null,null,null,null,null,null,null,null,null,null,null,null,null,null,null,null,null,null,null,null,null,85.8]
[null,null,null,null,null,null,null,null,null,null,null,null,null,null,null,null,null,null,null,null,null,null,null,null,null,null,null,85.9]
[null,null,null,null,null,null,null,null,null,null,null,null,null,null,null,null,null,null,null,null,null,null,null,null,null,null,null,86]
[null,null,null,null,null,null,null,null,null,null,null,null,null,null,null,null,null,null,null,null,null,null,null,null,null,null,null,86.1]
[null,null,null,null,null,null,null,null,null,null,null,null,null,null,null,null,null,null,null,null,null,null,null,null,null,null,null,86.2]
[null,null,null,null,null,null,null,null,null,null,null,null,null,null,null,null,null,null,null,null,null,null,null,null,null,null,null,86.3]
[null,null,null,null,null,null,null,null,null,null,null,null,null,null,null,null,null,null,null,null,null,null,null,null,null,null,null,86.4]
[null,null,null,null,null,null,null,null,null,null,null,null,null,null,null,null,null,null,null,null,null,null,null,null,null,null,null,86.5]
[null,null,null,null,null,null,null,null,null,null,null,null,null,null,null,null,null,null,null,null,null,null,null,null,null,null,null,86.6]
[null,null,null,null,null,null,null,null,null,null,null,null,null,null,null,null,null,null,null,null,null,null,null,null,null,null,null,86.7]
[null,null,null,null,null,null,null,null,null,null,null,null,null,null,null,null,null,null,null,null,null,null,null,null,null,null,null,86.8]
[null,null,null,null,null,null,null,null,null,null,null,null,null,null,null,null,null,null,null,null,null,null,null,null,null,null,null,86.9]
[null,null,null,null,null,null,null,null,null,null,null,null,null,null,null,null,null,null,null,null,null,null,null,null,null,null,null,87]
[null,null,null,null,null,null,null,null,null,null,null,null,null,null,null,null,null,null,null,null,null,null,null,null,null,null,null,87.1]
[null,null,null,null,null,null,null,null,null,null,null,null,null,null,null,null,null,null,null,null,null,null,null,null,null,null,null,87.2]
[null,null,null,null,null,null,null,null,null,null,null,null,null,null,null,null,null,null,null,null,null,null,null,null,null,null,null,87.3]
[null,null,null,null,null,null,null,null,null,null,null,null,null,null,null,null,null,null,null,null,null,null,null,null,null,null,null,87.4]
[null,null,null,null,null,null,null,null,null,null,null,null,null,null,null,null,null,null,null,null,null,null,null,null,null,null,null,87.5]
[null,null,null,null,null,null,null,null,null,null,null,null,null,null,null,null,null,null,null,null,null,null,null,null,null,null,null,87.6]
[null,null,null,null,null,null,null,null,null,null,null,null,null,null,null,null,null,null,null,null,null,null,null,null,null,null,null,87.7]
[null,null,null,null,null,null,null,null,null,null,null,null,null,null,null,null,null,null,null,null,null,null,null,null,null,null,null,87.8]
[null,null,null,null,null,null,null,null,null,null,null,null,null,null,null,null,null,null,null,null,null,null,null,null,null,null,null,87.9]
[null,null,null,null,null,null,null,null,null,null,null,null,null,null,null,null,null,null,null,null,null,null,null,null,null,null,null,88]
[null,null,null,null,null,null,null,null,null,null,null,null,null,null,null,null,null,null,null,null,null,null,null,null,null,null,null,88.1]
[null,null,null,null,null,null,null,null,null,null,null,null,null,null,null,null,null,null,null,null,null,null,null,null,null,null,null,88.2]
[null,null,null,null,null,null,null,null,null,null,null,null,null,null,null,null,null,null,null,null,null,null,null,null,null,null,null,88.3]
[null,null,null,null,null,null,null,null,null,null,null,null,null,null,null,null,null,null,null,null,null,null,null,null,null,null,null,88.4]
[null,null,null,null,null,null,null,null,null,null,null,null,null,null,null,null,null,null,null,null,null,null,null,null,null,null,null,88.5]
[null,null,null,null,null,null,null,null,null,null,null,null,null,null,null,null,null,null,null,null,null,null,null,null,null,null,null,88.6]
[null,null,null,null,null,null,null,null,null,null,null,null,null,null,null,null,null,null,null,null,null,null,null,null,null,null,null,88.7]
[null,null,null,null,null,null,null,null,null,null,null,null,null,null,null,null,null,null,null,null,null,null,null,null,null,null,null,88.8]
[null,null,null,null,null,null,null,null,null,null,null,null,null,null,null,null,null,null,null,null,null,null,null,null,null,null,null,88.9]
[null,null,null,null,null,null,null,null,null,null,null,null,null,null,null,null,null,null,null,null,null,null,null,null,null,null,null,89]
[null,null,null,null,null,null,null,null,null,null,null,null,null,null,null,null,null,null,null,null,null,null,null,null,null,null,null,89.1]
[null,null,null,null,null,null,null,null,null,null,null,null,null,null,null,null,null,null,null,null,null,null,null,null,null,null,null,89.2]
[null,null,null,null,null,null,null,null,null,null,null,null,null,null,null,null,null,null,null,null,null,null,null,null,null,null,null,89.3]
[null,null,null,null,null,null,null,null,null,null,null,null,null,null,null,null,null,null,null,null,null,null,null,null,null,null,null,89.4]
[null,null,null,null,null,null,null,null,null,null,null,null,null,null,null,null,null,null,null,null,null,null,null,null,null,null,null,89.5]
[null,null,null,null,null,null,null,null,null,null,null,null,null,null,null,null,null,null,null,null,null,null,null,null,null,null,null,89.6]
[null,null,null,null,null,null,null,null,null,null,null,null,null,null,null,null,null,null,null,null,null,null,null,null,null,null,null,89.7]
[null,null,null,null,null,null,null,null,null,null,null,null,null,null,null,null,null,null,null,null,null,null,null,null,null,null,null,89.8]
[null,null,null,null,null,null,null,null,null,null,null,null,null,null,null,null,null,null,null,null,null,null,null,null,null,null,null,89.9]
[null,null,null,null,null,null,null,null,null,null,null,null,null,null,null,null,null,null,null,null,null,null,null,null,null,null,null,90]

{"sheet":"Event Data Set","index":2,"n_rows":2405,"n_cols":16,"rows_kept":2405,"cut":false,"hidden":true,"merged":[]}
["points1 Sec",null,null,null,null,"award2 Sec",null,null,null,null,null,"award12 Pri"]
[]
["Balance Test-0",0,null,null,null,"Girls Pent","Boys Pent","Girls Dec","Boys Dec",null,null,null,"Girls Pent","Boys Pent","Girls Dec","Boys Dec"]
["Balance Test-1",1,null,null,0,"Step 1","Step 1","Step 1","Step 1",null,null,0,"Step 1","Step 1","Step 1","Step 1"]
["Balance Test-2",2,null,null,1,"Step 1","Step 1","Step 1","Step 1",null,null,1,"Step 1","Step 1","Step 1","Step 1"]
["Balance Test-3",3,null,null,2,"Step 1","Step 1","Step 1","Step 1",null,null,2,"Step 1","Step 1","Step 1","Step 1"]
["Balance Test-4",4,null,null,3,"Step 1","Step 1","Step 1","Step 1",null,null,3,"Step 1","Step 1","Step 1","Step 1"]
["Balance Test-5",5,null,null,4,"Step 1","Step 1","Step 1","Step 1",null,null,4,"Step 1","Step 1","Step 1","Step 1"]
["Balance Test-6",6,null,null,5,"Step 1","Step 1","Step 1","Step 1",null,null,5,"Step 1","Step 1","Step 1","Step 1"]
["Balance Test-7",7,null,null,6,"Step 1","Step 1","Step 1","Step 1",null,null,6,"Step 1","Step 1","Step 1","Step 1"]
["Balance Test-8",8,null,null,7,"Step 1","Step 1","Step 1","Step 1",null,null,7,"Step 1","Step 1","Step 1","Step 1"]
["Balance Test-9",9,null,null,8,"Step 1","Step 1","Step 1","Step 1",null,null,8,"Step 1","Step 1","Step 1","Step 1"]
["Balance Test-10",10,null,null,9,"Step 1","Step 1","Step 1","Step 1",null,null,9,"Step 1","Step 1","Step 1","Step 1"]
["Balance Test-11",11,null,null,10,"Step 1","Step 1","Step 1","Step 1",null,null,10,"Step 1","Step 1","Step 1","Step 1"]
["Balance Test-12",12,null,null,11,"Step 1","Step 1","Step 1","Step 1",null,null,11,"Step 1","Step 1","Step 1","Step 1"]
["Balance Test-13",13,null,null,12,"Step 1","Step 1","Step 1","Step 1",null,null,12,"Step 1","Step 1","Step 1","Step 1"]
["Balance Test-14",14,null,null,13,"Step 1","Step 1","Step 1","Step 1",null,null,13,"Step 1","Step 1","Step 1","Step 1"]
["Balance Test-15",15,null,null,14,"Step 1","Step 1","Step 1","Step 1",null,null,14,"Step 1","Step 1","Step 1","Step 1"]
["Balance Test-16",16,null,null,15,"Step 1","Step 1","Step 1","Step 1",null,null,15,"Step 1","Step 1","Step 1","Step 1"]
["Balance Test-17",17,null,null,16,"Step 1","Step 1","Step 1","Step 1",null,null,16,"Step 1","Step 1","Step 1","Step 1"]
["Balance Test-18",18,null,null,17,"Step 1","Step 1","Step 1","Step 1",null,null,17,"Step 1","Step 1","Step 1","Step 1"]
["Balance Test-19",19,null,null,18,"Step 1","Step 1","Step 1","Step 1",null,null,18,"Step 1","Step 1","Step 1","Step 1"]
["Balance Test-20",20,null,null,19,"Step 1","Step 1","Step 1","Step 1",null,null,19,"Step 1","Step 1","Step 1","Step 1"]
["Balance Test-21",21,null,null,20,"Step 1","Step 1","Step 1","Step 1",null,null,20,"Step 1","Step 1","Step 1","Step 1"]
["Balance Test-22",22,null,null,21,"Step 1","Step 1","Step 1","Step 1",null,null,21,"Step 1","Step 1","Step 1","Step 1"]
["Balance Test-23",23,null,null,22,"Step 1","Step 1","Step 1","Step 1",null,null,22,"Step 1","Step 1","Step 1","Step 1"]
["Balance Test-24",24,null,null,23,"Step 1","Step 1","Step 1","Step 1",null,null,23,"Step 1","Step 1","Step 1","Step 1"]
["Balance Test-25",25,null,null,24,"Step 1","Step 1","Step 1","Step 1",null,null,24,"Step 1","Step 1","Step 1","Step 1"]
["Balance Test-26",26,null,null,25,"Step 2","Step 2","Step 1","Step 1",null,null,25,"Step 1","Step 1","Step 1","Step 1"]
["Balance Test-27",27,null,null,26,"Step 2","Step 2","Step 1","Step 1",null,null,26,"Step 1","Step 1","Step 1","Step 1"]
["Balance Test-28",28,null,null,27,"Step 2","Step 2","Step 1","Step 1",null,null,27,"Step 1","Step 1","Step 1","Step 1"]
["Balance Test-29",29,null,null,28,"Step 2","Step 2","Step 1","Step 1",null,null,28,"Step 1","Step 1","Step 1","Step 1"]
["Balance Test-30",30,null,null,29,"Step 2","Step 2","Step 1","Step 1",null,null,29,"Step 1","Step 1","Step 1","Step 1"]
["Balance Test-31",31,null,null,30,"Step 2","Step 2","Step 1","Step 1",null,null,30,"Step 2","Step 2","Step 1","Step 1"]
["Balance Test-32",32,null,null,31,"Step 2","Step 2","Step 1","Step 1",null,null,31,"Step 2","Step 2","Step 1","Step 1"]
["Balance Test-33",33,null,null,32,"Step 2","Step 2","Step 1","Step 1",null,null,32,"Step 2","Step 2","Step 1","Step 1"]
["Balance Test-34",34,null,null,33,"Step 2","Step 2","Step 1","Step 1",null,null,33,"Step 2","Step 2","Step 1","Step 1"]
["Balance Test-35",35,null,null,34,"Step 2","Step 2","Step 1","Step 1",null,null,34,"Step 2","Step 2","Step 1","Step 1"]
["Balance Test-36",36,null,null,35,"Step 2","Step 2","Step 1","Step 1",null,null,35,"Step 2","Step 2","Step 1","Step 1"]
["Balance Test-37",38,null,null,36,"Step 2","Step 2","Step 1","Step 1",null,null,36,"Step 2","Step 2","Step 1","Step 1"]
["Balance Test-38",40,null,null,37,"Step 2","Step 2","Step 1","Step 1",null,null,37,"Step 2","Step 2","Step 1","Step 1"]
["Balance Test-39",42,null,null,38,"Step 2","Step 2","Step 1","Step 1",null,null,38,"Step 2","Step 2","Step 1","Step 1"]
["Balance Test-40",44,null,null,39,"Step 2","Step 2","Step 1","Step 1",null,null,39,"Step 2","Step 2","Step 1","Step 1"]
["Balance Test-41",46,null,null,40,"Step 2","Step 2","Step 1","Step 1",null,null,40,"Step 2","Step 2","Step 2","Step 1"]
["Balance Test-42",47,null,null,41,"Step 2","Step 2","Step 1","Step 1",null,null,41,"Step 2","Step 2","Step 2","Step 1"]
["Balance Test-43",48,null,null,42,"Step 2","Step 2","Step 1","Step 1",null,null,42,"Step 2","Step 2","Step 2","Step 1"]
["Balance Test-44",49,null,null,43,"Step 2","Step 2","Step 1","Step 1",null,null,43,"Step 2","Step 2","Step 2","Step 1"]
["Balance Test-45",50,null,null,44,"Step 2","Step 2","Step 1","Step 1",null,null,44,"Step 2","Step 2","Step 2","Step 1"]
["Balance Test-46",51,null,null,45,"Step 2","Step 2","Step 1","Step 1",null,null,45,"Step 2","Step 2","Step 2","Step 1"]
["Balance Test-47",52,null,null,46,"Step 2","Step 2","Step 1","Step 1",null,null,46,"Step 2","Step 2","Step 2","Step 1"]
["Balance Test-48",53,null,null,47,"Step 2","Step 2","Step 1","Step 1",null,null,47,"Step 2","Step 2","Step 2","Step 1"]
["Balance Test-49",54,null,null,48,"Step 2","Step 2","Step 1","Step 1",null,null,48,"Step 2","Step 2","Step 2","Step 1"]
["Balance Test-50",55,null,null,49,"Step 2","Step 2","Step 1","Step 1",null,null,49,"Step 2","Step 2","Step 2","Step 1"]
["Balance Test-51",56,null,null,50,"Step 2","Step 3","Step 2","Step 2",null,null,50,"Step 2","Step 2","Step 2","Step 2"]
["Balance Test-52",57,null,null,51,"Step 3","Step 3","Step 2","Step 2",null,null,51,"Step 2","Step 2","Step 2","Step 2"]
["Balance Test-53",58,null,null,52,"Step 3","Step 3","Step 2","Step 2",null,null,52,"Step 2","Step 2","Step 2","Step 2"]
["Balance Test-54",59,null,null,53,"Step 3","Step 3","Step 2","Step 2",null,null,53,"Step 2","Step 2","Step 2","Step 2"]
["Balance Test-55",60,null,null,54,"Step 3","Step 3","Step 2","Step 2",null,null,54,"Step 2","Step 2","Step 2","Step 2"]
["Balance Test-56",61,null,null,55,"Step 3","Step 3","Step 2","Step 2",null,null,55,"Step 2","Step 2","Step 2","Step 2"]
["Balance Test-57",62,null,null,56,"Step 3","Step 3","Step 2","Step 2",null,null,56,"Step 2","Step 2","Step 2","Step 2"]
["Balance Test-58",63,null,null,57,"Step 3","Step 3","Step 2","Step 2",null,null,57,"Step 2","Step 2","Step 2","Step 2"]
["Balance Test-59",64,null,null,58,"Step 3","Step 3","Step 2","Step 2",null,null,58,"Step 2","Step 2","Step 2","Step 2"]
["Balance Test-60",65,null,null,59,"Step 3","Step 3","Step 2","Step 2",null,null,59,"Step 2","Step 2","Step 2","Step 2"]
["Standing Long Jump-0.01",1,null,null,60,"Step 3","Step 3","Step 2","Step 2",null,null,60,"Step 3","Step 3","Step 2","Step 2"]
["Standing Long Jump-0.02",1,null,null,61,"Step 3","Step 3","Step 2","Step 2",null,null,61,"Step 3","Step 3","Step 2","Step 2"]
["Standing Long Jump-0.03",1,null,null,62,"Step 3","Step 3","Step 2","Step 2",null,null,62,"Step 3","Step 3","Step 2","Step 2"]
["Standing Long Jump-0.04",1,null,null,63,"Step 3","Step 3","Step 2","Step 2",null,null,63,"Step 3","Step 3","Step 2","Step 2"]
["Standing Long Jump-0.05",1,null,null,64,"Step 3","Step 3","Step 2","Step 2",null,null,64,"Step 3","Step 3","Step 2","Step 2"]
["Standing Long Jump-0.06",1,null,null,65,"Step 3","Step 3","Step 2","Step 2",null,null,65,"Step 3","Step 3","Step 2","Step 2"]
["Standing Long Jump-0.07",1,null,null,66,"Step 3","Step 3","Step 2","Step 2",null,null,66,"Step 3","Step 3","Step 2","Step 2"]
["Standing Long Jump-0.08",1,null,null,67,"Step 3","Step 3","Step 2","Step 2",null,null,67,"Step 3","Step 3","Step 2","Step 2"]
["Standing Long Jump-0.09",1,null,null,68,"Step 3","Step 3","Step 2","Step 2",null,null,68,"Step 3","Step 3","Step 2","Step 2"]
["Standing Long Jump-0.1",1,null,null,69,"Step 3","Step 3","Step 2","Step 2",null,null,69,"Step 3","Step 3","Step 2","Step 2"]
["Standing Long Jump-0.11",1,null,null,70,"Step 3","Step 3","Step 2","Step 2",null,null,70,"Step 3","Step 3","Step 2","Step 2"]
["Standing Long Jump-0.12",1,null,null,71,"Step 3","Step 3","Step 2","Step 2",null,null,71,"Step 3","Step 3","Step 2","Step 2"]
["Standing Long Jump-0.13",1,null,null,72,"Step 3","Step 3","Step 2","Step 2",null,null,72,"Step 3","Step 3","Step 2","Step 2"]
["Standing Long Jump-0.14",1,null,null,73,"Step 3","Step 3","Step 2","Step 2",null,null,73,"Step 3","Step 3","Step 2","Step 2"]
["Standing Long Jump-0.15",1,null,null,74,"Step 3","Step 3","Step 2","Step 2",null,null,74,"Step 3","Step 3","Step 2","Step 2"]
["Standing Long Jump-0.16",1,null,null,75,"Step 3","Step 3","Step 2","Step 2",null,null,75,"Step 3","Step 3","Step 2","Step 2"]
["Standing Long Jump-0.17",1,null,null,76,"Step 3","Step 3","Step 2","Step 2",null,null,76,"Step 3","Step 3","Step 2","Step 2"]
["Standing Long Jump-0.18",1,null,null,77,"Step 3","Step 3","Step 2","Step 2",null,null,77,"Step 3","Step 3","Step 2","Step 2"]
["Standing Long Jump-0.19",1,null,null,78,"Step 3","Step 3","Step 2","Step 2",null,null,78,"Step 3","Step 3","Step 2","Step 2"]
["Standing Long Jump-0.2",1,null,null,79,"Step 3","Step 3","Step 2","Step 2",null,null,79,"Step 3","Step 3","Step 2","Step 2"]
["Standing Long Jump-0.21",1,null,null,80,"Step 4","Step 4","Step 2","Step 2",null,null,80,"Step 4","Step 4","Step 3","Step 2"]
["Standing Long Jump-0.22",1,null,null,81,"Step 4","Step 4","Step 2","Step 2",null,null,81,"Step 4","Step 4","Step 3","Step 2"]
["Standing Long Jump-0.23",1,null,null,82,"Step 4","Step 4","Step 2","Step 2",null,null,82,"Step 4","Step 4","Step 3","Step 2"]
["Standing Long Jump-0.24",1,null,null,83,"Step 4","Step 4","Step 2","Step 2",null,null,83,"Step 4","Step 4","Step 3","Step 2"]
["Standing Long Jump-0.25",1,null,null,84,"Step 4","Step 4","Step 2","Step 2",null,null,84,"Step 4","Step 4","Step 3","Step 2"]
["Standing Long Jump-0.26",1,null,null,85,"Step 4","Step 4","Step 2","Step 2",null,null,85,"Step 4","Step 4","Step 3","Step 2"]
["Standing Long Jump-0.27",1,null,null,86,"Step 4","Step 4","Step 2","Step 2",null,null,86,"Step 4","Step 4","Step 3","Step 2"]
["Standing Long Jump-0.28",1,null,null,87,"Step 4","Step 4","Step 2","Step 2",null,null,87,"Step 4","Step 4","Step 3","Step 2"]
["Standing Long Jump-0.29",1,null,null,88,"Step 4","Step 4","Step 2","Step 2",null,null,88,"Step 4","Step 4","Step 3","Step 2"]
["Standing Long Jump-0.3",1,null,null,89,"Step 4","Step 4","Step 2","Step 2",null,null,89,"Step 4","Step 4","Step 3","Step 2"]
["Standing Long Jump-0.31",1,null,null,90,"Step 4","Step 4","Step 2","Step 2",null,null,90,"Step 4","Step 4","Step 3","Step 2"]
["Standing Long Jump-0.32",1,null,null,91,"Step 4","Step 4","Step 2","Step 2",null,null,91,"Step 4","Step 4","Step 3","Step 2"]
["Standing Long Jump-0.33",1,null,null,92,"Step 4","Step 4","Step 2","Step 2",null,null,92,"Step 4","Step 4","Step 3","Step 2"]
["Standing Long Jump-0.34",1,null,null,93,"Step 4","Step 4","Step 2","Step 2",null,null,93,"Step 4","Step 4","Step 3","Step 2"]
["Standing Long Jump-0.35",1,null,null,94,"Step 4","Step 4","Step 2","Step 2",null,null,94,"Step 4","Step 4","Step 3","Step 2"]
["Standing Long Jump-0.36",1,null,null,95,"Step 5","Step 4","Step 2","Step 2",null,null,95,"Step 4","Step 4","Step 3","Step 2"]
["Standing Long Jump-0.37",1,null,null,96,"Step 5","Step 4","Step 2","Step 2",null,null,96,"Step 4","Step 4","Step 3","Step 2"]
["Standing Long Jump-0.38",1,null,null,97,"Step 5","Step 4","Step 2","Step 2",null,null,97,"Step 4","Step 4","Step 3","Step 2"]
["Standing Long Jump-0.39",1,null,null,98,"Step 5","Step 4","Step 2","Step 2",null,null,98,"Step 4","Step 4","Step 3","Step 2"]
["Standing Long Jump-0.4",2,null,null,99,"Step 5","Step 4","Step 2","Step 2",null,null,99,"Step 4","Step 4","Step 3","Step 2"]
["Standing Long Jump-0.41",2,null,null,100,"Step 5","Step 5","Step 3","Step 3",null,null,100,"Step 5","Step 5","Step 3","Step 3"]
["Standing Long Jump-0.42",2,null,null,101,"Step 5","Step 5","Step 3","Step 3",null,null,101,"Step 5","Step 5","Step 3","Step 3"]
["Standing Long Jump-0.43",2,null,null,102,"Step 5","Step 5","Step 3","Step 3",null,null,102,"Step 5","Step 5","Step 3","Step 3"]
["Standing Long Jump-0.44",2,null,null,103,"Step 5","Step 5","Step 3","Step 3",null,null,103,"Step 5","Step 5","Step 3","Step 3"]
["Standing Long Jump-0.45",3,null,null,104,"Step 5","Step 5","Step 3","Step 3",null,null,104,"Step 5","Step 5","Step 3","Step 3"]
["Standing Long Jump-0.46",3,null,null,105,"Step 5","Step 5","Step 3","Step 3",null,null,105,"Step 5","Step 5","Step 3","Step 3"]
["Standing Long Jump-0.47",3,null,null,106,"Step 5","Step 5","Step 3","Step 3",null,null,106,"Step 5","Step 5","Step 3","Step 3"]
["Standing Long Jump-0.48",3,null,null,107,"Step 5","Step 5","Step 3","Step 3",null,null,107,"Step 5","Step 5","Step 3","Step 3"]
["Standing Long Jump-0.49",3,null,null,108,"Step 5","Step 5","Step 3","Step 3",null,null,108,"Step 5","Step 5","Step 3","Step 3"]
["Standing Long Jump-0.5",4,null,null,109,"Step 5","Step 5","Step 3","Step 3",null,null,109,"Step 5","Step 5","Step 3","Step 3"]
["Standing Long Jump-0.51",4,null,null,110,"Step 6","Step 5","Step 3","Step 3",null,null,110,"Step 6","Step 5","Step 3","Step 3"]
["Standing Long Jump-0.52",4,null,null,111,"Step 6","Step 5","Step 3","Step 3",null,null,111,"Step 6","Step 5","Step 3","Step 3"]
["Standing Long Jump-0.53",4,null,null,112,"Step 6","Step 5","Step 3","Step 3",null,null,112,"Step 6","Step 5","Step 3","Step 3"]
["Standing Long Jump-0.54",4,null,null,113,"Step 6","Step 5","Step 3","Step 3",null,null,113,"Step 6","Step 5","Step 3","Step 3"]
["Standing Long Jump-0.55",5,null,null,114,"Step 6","Step 5","Step 3","Step 3",null,null,114,"Step 6","Step 5","Step 3","Step 3"]
["Standing Long Jump-0.56",5,null,null,115,"Step 6","Step 6","Step 3","Step 3",null,null,115,"Step 6","Step 6","Step 3","Step 3"]
["Standing Long Jump-0.57",5,null,null,116,"Step 6","Step 6","Step 3","Step 3",null,null,116,"Step 6","Step 6","Step 3","Step 3"]
["Standing Long Jump-0.58",5,null,null,117,"Step 6","Step 6","Step 3","Step 3",null,null,117,"Step 6","Step 6","Step 3","Step 3"]
["Standing Long Jump-0.59",5,null,null,118,"Step 6","Step 6","Step 3","Step 3",null,null,118,"Step 6","Step 6","Step 3","Step 3"]
["Standing Long Jump-0.6",6,null,null,119,"Step 6","Step 6","Step 3","Step 3",null,null,119,"Step 6","Step 6","Step 3","Step 3"]
["Standing Long Jump-0.61",6,null,null,120,"Step 6","Step 6","Step 3","Step 3",null,null,120,"Step 6","Step 6","Step 4","Step 3"]
["Standing Long Jump-0.62",6,null,null,121,"Step 6","Step 6","Step 3","Step 3",null,null,121,"Step 6","Step 6","Step 4","Step 3"]
["Standing Long Jump-0.63",6,null,null,122,"Step 6","Step 6","Step 3","Step 3",null,null,122,"Step 6","Step 6","Step 4","Step 3"]
["Standing Long Jump-0.64",6,null,null,123,"Step 6","Step 6","Step 3","Step 3",null,null,123,"Step 6","Step 6","Step 4","Step 3"]
["Standing Long Jump-0.65",7,null,null,124,"Step 6","Step 6","Step 3","Step 3",null,null,124,"Step 6","Step 6","Step 4","Step 3"]
["Standing Long Jump-0.66",7,null,null,125,"Step 6","Step 6","Step 3","Step 3",null,null,125,"Step 7","Step 6","Step 4","Step 3"]
["Standing Long Jump-0.67",7,null,null,126,"Step 6","Step 6","Step 3","Step 3",null,null,126,"Step 7","Step 6","Step 4","Step 3"]
["Standing Long Jump-0.68",7,null,null,127,"Step 6","Step 6","Step 3","Step 3",null,null,127,"Step 7","Step 6","Step 4","Step 3"]
["Standing Long Jump-0.69",7,null,null,128,"Step 6","Step 6","Step 3","Step 3",null,null,128,"Step 7","Step 6","Step 4","Step 3"]
["Standing Long Jump-0.7",8,null,null,129,"Step 6","Step 6","Step 3","Step 3",null,null,129,"Step 7","Step 6","Step 4","Step 3"]
["Standing Long Jump-0.71",8,null,null,130,"Step 6","Step 6","Step 3","Step 3",null,null,130,"Step 7","Step 7","Step 4","Step 3"]
["Standing Long Jump-0.72",8,null,null,131,"Step 6","Step 6","Step 3","Step 3",null,null,131,"Step 7","Step 7","Step 4","Step 3"]
["Standing Long Jump-0.73",8,null,null,132,"Step 6","Step 6","Step 3","Step 3",null,null,132,"Step 7","Step 7","Step 4","Step 3"]
["Standing Long Jump-0.74",8,null,null,133,"Step 6","Step 6","Step 3","Step 3",null,null,133,"Step 7","Step 7","Step 4","Step 3"]
["Standing Long Jump-0.75",9,null,null,134,"Step 6","Step 6","Step 3","Step 3",null,null,134,"Step 7","Step 7","Step 4","Step 3"]
["Standing Long Jump-0.76",9,null,null,135,"Step 6","Step 6","Step 3","Step 3",null,null,135,"Step 7","Step 7","Step 4","Step 3"]
["Standing Long Jump-0.77",9,null,null,136,"Step 6","Step 6","Step 3","Step 3",null,null,136,"Step 7","Step 7","Step 4","Step 3"]
["Standing Long Jump-0.78",9,null,null,137,"Step 6","Step 6","Step 3","Step 3",null,null,137,"Step 7","Step 7","Step 4","Step 3"]
["Standing Long Jump-0.79",9,null,null,138,"Step 6","Step 6","Step 3","Step 3",null,null,138,"Step 7","Step 7","Step 4","Step 3"]
["Standing Long Jump-0.8",10,null,null,139,"Step 6","Step 6","Step 3","Step 3",null,null,139,"Step 7","Step 7","Step 4","Step 3"]
["Standing Long Jump-0.81",10,null,null,140,"Step 7","Step 6","Step 3","Step 3",null,null,140,"Step 8","Step 7","Step 4","Step 3"]
["Standing Long Jump-0.82",10,null,null,141,"Step 7","Step 6","Step 3","Step 3",null,null,141,"Step 8","Step 7","Step 4","Step 3"]
["Standing Long Jump-0.83",10,null,null,142,"Step 7","Step 6","Step 3","Step 3",null,null,142,"Step 8","Step 7","Step 4","Step 3"]
["Standing Long Jump-0.84",10,null,null,143,"Step 7","Step 6","Step 3","Step 3",null,null,143,"Step 8","Step 7","Step 4","Step 3"]
["Standing Long Jump-0.85",11,null,null,144,"Step 7","Step 6","Step 3","Step 3",null,null,144,"Step 8","Step 7","Step 4","Step 3"]
["Standing Long Jump-0.86",11,null,null,145,"Step 7","Step 6","Step 3","Step 3",null,null,145,"Step 8","Step 8","Step 4","Step 3"]
["Standing Long Jump-0.87",11,null,null,146,"Step 7","Step 6","Step 3","Step 3",null,null,146,"Step 8","Step 8","Step 4","Step 3"]
["Standing Long Jump-0.88",11,null,null,147,"Step 7","Step 6","Step 3","Step 3",null,null,147,"Step 8","Step 8","Step 4","Step 3"]
["Standing Long Jump-0.89",11,null,null,148,"Step 7","Step 6","Step 3","Step 3",null,null,148,"Step 8","Step 8","Step 4","Step 3"]
["Standing Long Jump-0.9",12,null,null,149,"Step 7","Step 6","Step 3","Step 3",null,null,149,"Step 8","Step 8","Step 4","Step 3"]
["Standing Long Jump-0.91",12,null,null,150,"Step 7","Step 7","Step 4","Step 4",null,null,150,"Step 9","Step 8","Step 5","Step 4"]
["Standing Long Jump-0.92",12,null,null,151,"Step 7","Step 7","Step 4","Step 4",null,null,151,"Step 9","Step 8","Step 5","Step 4"]
["Standing Long Jump-0.93",12,null,null,152,"Step 7","Step 7","Step 4","Step 4",null,null,152,"Step 9","Step 8","Step 5","Step 4"]
["Standing Long Jump-0.94",12,null,null,153,"Step 7","Step 7","Step 4","Step 4",null,null,153,"Step 9","Step 8","Step 5","Step 4"]
["Standing Long Jump-0.95",13,null,null,154,"Step 7","Step 7","Step 4","Step 4",null,null,154,"Step 9","Step 8","Step 5","Step 4"]
["Standing Long Jump-0.96",13,null,null,155,"Step 7","Step 7","Step 4","Step 4",null,null,155,"Step 9","Step 8","Step 5","Step 4"]
["Standing Long Jump-0.97",13,null,null,156,"Step 7","Step 7","Step 4","Step 4",null,null,156,"Step 9","Step 8","Step 5","Step 4"]
["Standing Long Jump-0.98",13,null,null,157,"Step 7","Step 7","Step 4","Step 4",null,null,157,"Step 9","Step 8","Step 5","Step 4"]
["Standing Long Jump-0.99",13,null,null,158,"Step 7","Step 7","Step 4","Step 4",null,null,158,"Step 9","Step 8","Step 5","Step 4"]
["Standing Long Jump-1",14,null,null,159,"Step 7","Step 7","Step 4","Step 4",null,null,159,"Step 9","Step 8","Step 5","Step 4"]
["Standing Long Jump-1.01",14,null,null,160,"Step 8","Step 7","Step 4","Step 4",null,null,160,"Step 10","Step 9","Step 5","Step 4"]
["Standing Long Jump-1.02",14,null,null,161,"Step 8","Step 7","Step 4","Step 4",null,null,161,"Step 10","Step 9","Step 5","Step 4"]
["Standing Long Jump-1.03",14,null,null,162,"Step 8","Step 7","Step 4","Step 4",null,null,162,"Step 10","Step 9","Step 5","Step 4"]
["Standing Long Jump-1.04",14,null,null,163,"Step 8","Step 7","Step 4","Step 4",null,null,163,"Step 10","Step 9","Step 5","Step 4"]
["Standing Long Jump-1.05",15,null,null,164,"Step 8","Step 7","Step 4","Step 4",null,null,164,"Step 10","Step 9","Step 5","Step 4"]
["Standing Long Jump-1.06",15,null,null,165,"Step 8","Step 7","Step 4","Step 4",null,null,165,"Step 10","Step 9","Step 5","Step 4"]
["Standing Long Jump-1.07",15,null,null,166,"Step 8","Step 7","Step 4","Step 4",null,null,166,"Step 10","Step 9","Step 5","Step 4"]
["Standing Long Jump-1.08",15,null,null,167,"Step 8","Step 7","Step 4","Step 4",null,null,167,"Step 10","Step 9","Step 5","Step 4"]
["Standing Long Jump-1.09",15,null,null,168,"Step 8","Step 7","Step 4","Step 4",null,null,168,"Step 10","Step 9","Step 5","Step 4"]
["Standing Long Jump-1.1",16,null,null,169,"Step 8","Step 7","Step 4","Step 4",null,null,169,"Step 10","Step 9","Step 5","Step 4"]
["Standing Long Jump-1.11",16,null,null,170,"Step 8","Step 8","Step 4","Step 4",null,null,170,"Bronze","Step 10","Step 5","Step 4"]
["Standing Long Jump-1.12",16,null,null,171,"Step 8","Step 8","Step 4","Step 4",null,null,171,"Bronze","Step 10","Step 5","Step 4"]
["Standing Long Jump-1.13",16,null,null,172,"Step 8","Step 8","Step 4","Step 4",null,null,172,"Bronze","Step 10","Step 5","Step 4"]
["Standing Long Jump-1.14",16,null,null,173,"Step 8","Step 8","Step 4","Step 4",null,null,173,"Bronze","Step 10","Step 5","Step 4"]
["Standing Long Jump-1.15",17,null,null,174,"Step 8","Step 8","Step 4","Step 4",null,null,174,"Bronze","Step 10","Step 5","Step 4"]
["Standing Long Jump-1.16",17,null,null,175,"Step 8","Step 8","Step 4","Step 4",null,null,175,"Bronze","Step 10","Step 5","Step 4"]
["Standing Long Jump-1.17",17,null,null,176,"Step 8","Step 8","Step 4","Step 4",null,null,176,"Bronze","Step 10","Step 5","Step 4"]
["Standing Long Jump-1.18",17,null,null,177,"Step 8","Step 8","Step 4","Step 4",null,null,177,"Bronze","Step 10","Step 5","Step 4"]
["Standing Long Jump-1.19",17,null,null,178,"Step 8","Step 8","Step 4","Step 4",null,null,178,"Bronze","Step 10","Step 5","Step 4"]
["Standing Long Jump-1.2",18,null,null,179,"Step 8","Step 8","Step 4","Step 4",null,null,179,"Bronze","Step 10","Step 5","Step 4"]
["Standing Long Jump-1.21",18,null,null,180,"Step 9","Step 8","Step 5","Step 4",null,null,180,"Bronze","Bronze","Step 6","Step 5"]
["Standing Long Jump-1.22",18,null,null,181,"Step 9","Step 8","Step 5","Step 4",null,null,181,"Bronze","Bronze","Step 6","Step 5"]
["Standing Long Jump-1.23",18,null,null,182,"Step 9","Step 8","Step 5","Step 4",null,null,182,"Bronze","Bronze","Step 6","Step 5"]
["Standing Long Jump-1.24",18,null,null,183,"Step 9","Step 8","Step 5","Step 4",null,null,183,"Bronze","Bronze","Step 6","Step 5"]
["Standing Long Jump-1.25",19,null,null,184,"Step 9","Step 8","Step 5","Step 4",null,null,184,"Bronze","Bronze","Step 6","Step 5"]
["Standing Long Jump-1.26",19,null,null,185,"Step 9","Step 8","Step 5","Step 4",null,null,185,"Bronze","Bronze","Step 6","Step 5"]
["Standing Long Jump-1.27",19,null,null,186,"Step 9","Step 8","Step 5","Step 4",null,null,186,"Bronze","Bronze","Step 6","Step 5"]
["Standing Long Jump-1.28",19,null,null,187,"Step 9","Step 8","Step 5","Step 4",null,null,187,"Bronze","Bronze","Step 6","Step 5"]
["Standing Long Jump-1.29",19,null,null,188,"Step 9","Step 8","Step 5","Step 4",null,null,188,"Bronze","Bronze","Step 6","Step 5"]
["Standing Long Jump-1.3",20,null,null,189,"Step 9","Step 8","Step 5","Step 4",null,null,189,"Bronze","Bronze","Step 6","Step 5"]
["Standing Long Jump-1.31",20,null,null,190,"Step 9","Step 9","Step 5","Step 5",null,null,190,"Bronze","Bronze","Step 6","Step 5"]
["Standing Long Jump-1.32",21,null,null,191,"Step 9","Step 9","Step 5","Step 5",null,null,191,"Bronze","Bronze","Step 6","Step 5"]
["Standing Long Jump-1.33",21,null,null,192,"Step 9","Step 9","Step 5","Step 5",null,null,192,"Bronze","Bronze","Step 6","Step 5"]
["Standing Long Jump-1.34",22,null,null,193,"Step 9","Step 9","Step 5","Step 5",null,null,193,"Bronze","Bronze","Step 6","Step 5"]
["Standing Long Jump-1.35",22,null,null,194,"Step 9","Step 9","Step 5","Step 5",null,null,194,"Bronze","Bronze","Step 6","Step 5"]
["Standing Long Jump-1.36",23,null,null,195,"Step 9","Step 9","Step 5","Step 5",null,null,195,"Bronze","Bronze","Step 6","Step 5"]
["Standing Long Jump-1.37",23,null,null,196,"Step 9","Step 9","Step 5","Step 5",null,null,196,"Bronze","Bronze","Step 6","Step 5"]
["Standing Long Jump-1.38",24,null,null,197,"Step 9","Step 9","Step 5","Step 5",null,null,197,"Bronze","Bronze","Step 6","Step 5"]
["Standing Long Jump-1.39",24,null,null,198,"Step 9","Step 9","Step 5","Step 5",null,null,198,"Bronze","Bronze","Step 6","Step 5"]
["Standing Long Jump-1.4",25,null,null,199,"Step 9","Step 9","Step 5","Step 5",null,null,199,"Bronze","Bronze","Step 6","Step 5"]
["Standing Long Jump-1.41",25,null,null,200,"Step 10","Step 9","Step 5","Step 5",null,null,200,"Bronze","Bronze","Step 6","Step 5"]
["Standing Long Jump-1.42",26,null,null,201,"Step 10","Step 9","Step 5","Step 5",null,null,201,"Bronze","Bronze","Step 6","Step 5"]
["Standing Long Jump-1.43",26,null,null,202,"Step 10","Step 9","Step 5","Step 5",null,null,202,"Bronze","Bronze","Step 6","Step 5"]
["Standing Long Jump-1.44",27,null,null,203,"Step 10","Step 9","Step 5","Step 5",null,null,203,"Bronze","Bronze","Step 6","Step 5"]
["Standing Long Jump-1.45",27,null,null,204,"Step 10","Step 9","Step 5","Step 5",null,null,204,"Bronze","Bronze","Step 6","Step 5"]
["Standing Long Jump-1.46",28,null,null,205,"Step 10","Step 9","Step 5","Step 5",null,null,205,"Bronze","Bronze","Step 6","Step 5"]
["Standing Long Jump-1.47",28,null,null,206,"Step 10","Step 9","Step 5","Step 5",null,null,206,"Bronze","Bronze","Step 6","Step 5"]
["Standing Long Jump-1.48",29,null,null,207,"Step 10","Step 9","Step 5","Step 5",null,null,207,"Bronze","Bronze","Step 6","Step 5"]
["Standing Long Jump-1.49",29,null,null,208,"Step 10","Step 9","Step 5","Step 5",null,null,208,"Bronze","Bronze","Step 6","Step 5"]
["Standing Long Jump-1.5",30,null,null,209,"Step 10","Step 9","Step 5","Step 5",null,null,209,"Bronze","Bronze","Step 6","Step 5"]
["Standing Long Jump-1.51",31,null,null,210,"Step 10","Step 10","Step 6","Step 5",null,null,210,"Bronze","Bronze","Step 7","Step 6"]
["Standing Long Jump-1.52",32,null,null,211,"Step 10","Step 10","Step 6","Step 5",null,null,211,"Bronze","Bronze","Step 7","Step 6"]
["Standing Long Jump-1.53",33,null,null,212,"Step 10","Step 10","Step 6","Step 5",null,null,212,"Bronze","Bronze","Step 7","Step 6"]
["Standing Long Jump-1.54",34,null,null,213,"Step 10","Step 10","Step 6","Step 5",null,null,213,"Bronze","Bronze","Step 7","Step 6"]
["Standing Long Jump-1.55",35,null,null,214,"Step 10","Step 10","Step 6","Step 5",null,null,214,"Bronze","Bronze","Step 7","Step 6"]
["Standing Long Jump-1.56",36,null,null,215,"Step 10","Step 10","Step 6","Step 5",null,null,215,"Bronze","Bronze","Step 7","Step 6"]
["Standing Long Jump-1.57",37,null,null,216,"Step 10","Step 10","Step 6","Step 5",null,null,216,"Bronze","Bronze","Step 7","Step 6"]
["Standing Long Jump-1.58",38,null,null,217,"Step 10","Step 10","Step 6","Step 5",null,null,217,"Bronze","Bronze","Step 7","Step 6"]
["Standing Long Jump-1.59",39,null,null,218,"Step 10","Step 10","Step 6","Step 5",null,null,218,"Bronze","Bronze","Step 7","Step 6"]
["Standing Long Jump-1.6",40,null,null,219,"Step 10","Step 10","Step 6","Step 5",null,null,219,"Bronze","Bronze","Step 7","Step 6"]
["Standing Long Jump-1.61",40,null,null,220,"Step 10","Step 10","Step 6","Step 6",null,null,220,"Silver","Bronze","Step 7","Step 6"]
["Standing Long Jump-1.62",41,null,null,221,"Step 10","Step 10","Step 6","Step 6",null,null,221,"Silver","Bronze","Step 7","Step 6"]
["Standing Long Jump-1.63",41,null,null,222,"Step 10","Step 10","Step 6","Step 6",null,null,222,"Silver","Bronze","Step 7","Step 6"]
["Standing Long Jump-1.64",42,null,null,223,"Step 10","Step 10","Step 6","Step 6",null,null,223,"Silver","Bronze","Step 7","Step 6"]
["Standing Long Jump-1.65",42,null,null,224,"Step 10","Step 10","Step 6","Step 6",null,null,224,"Silver","Bronze","Step 7","Step 6"]
["Standing Long Jump-1.66",43,null,null,225,"Bronze","Step 10","Step 6","Step 6",null,null,225,"Silver","Bronze","Step 7","Step 6"]
["Standing Long Jump-1.67",43,null,null,226,"Bronze","Step 10","Step 6","Step 6",null,null,226,"Silver","Bronze","Step 7","Step 6"]
["Standing Long Jump-1.68",44,null,null,227,"Bronze","Step 10","Step 6","Step 6",null,null,227,"Silver","Bronze","Step 7","Step 6"]
["Standing Long Jump-1.69",44,null,null,228,"Bronze","Step 10","Step 6","Step 6",null,null,228,"Silver","Bronze","Step 7","Step 6"]
["Standing Long Jump-1.7",45,null,null,229,"Bronze","Step 10","Step 6","Step 6",null,null,229,"Silver","Bronze","Step 7","Step 6"]
["Standing Long Jump-1.71",45,null,null,230,"Bronze","Step 10","Step 6","Step 6",null,null,230,"Silver","Silver","Step 7","Step 6"]
["Standing Long Jump-1.72",46,null,null,231,"Bronze","Step 10","Step 6","Step 6",null,null,231,"Silver","Silver","Step 7","Step 6"]
["Standing Long Jump-1.73",46,null,null,232,"Bronze","Step 10","Step 6","Step 6",null,null,232,"Silver","Silver","Step 7","Step 6"]
["Standing Long Jump-1.74",47,null,null,233,"Bronze","Step 10","Step 6","Step 6",null,null,233,"Silver","Silver","Step 7","Step 6"]
["Standing Long Jump-1.75",47,null,null,234,"Bronze","Step 10","Step 6","Step 6",null,null,234,"Silver","Silver","Step 7","Step 6"]
["Standing Long Jump-1.76",48,null,null,235,"Bronze","Bronze","Step 6","Step 6",null,null,235,"Silver","Silver","Step 7","Step 6"]
["Standing Long Jump-1.77",48,null,null,236,"Bronze","Bronze","Step 6","Step 6",null,null,236,"Silver","Silver","Step 7","Step 6"]
["Standing Long Jump-1.78",49,null,null,237,"Bronze","Bronze","Step 6","Step 6",null,null,237,"Silver","Silver","Step 7","Step 6"]
["Standing Long Jump-1.79",49,null,null,238,"Bronze","Bronze","Step 6","Step 6",null,null,238,"Silver","Silver","Step 7","Step 6"]
["Standing Long Jump-1.8",50,null,null,239,"Bronze","Bronze","Step 6","Step 6",null,null,239,"Silver","Silver","Step 7","Step 6"]
["Standing Long Jump-1.81",50,null,null,240,"Bronze","Bronze","Step 6","Step 6",null,null,240,"Gold","Silver","Step 8","Step 7"]
["Standing Long Jump-1.82",50,null,null,241,"Bronze","Bronze","Step 6","Step 6",null,null,241,"Gold","Silver","Step 8","Step 7"]
["Standing Long Jump-1.83",51,null,null,242,"Bronze","Bronze","Step 6","Step 6",null,null,242,"Gold","Silver","Step 8","Step 7"]
["Standing Long Jump-1.84",51,null,null,243,"Bronze","Bronze","Step 6","Step 6",null,null,243,"Gold","Silver","Step 8","Step 7"]
["Standing Long Jump-1.85",51,null,null,244,"Bronze","Bronze","Step 6","Step 6",null,null,244,"Gold","Silver","Step 8","Step 7"]
["Standing Long Jump-1.86",52,null,null,245,"Bronze","Bronze","Step 6","Step 6",null,null,245,"Gold","Silver","Step 8","Step 7"]
["Standing Long Jump-1.87",52,null,null,246,"Bronze","Bronze","Step 6","Step 6",null,null,246,"Gold","Silver","Step 8","Step 7"]
["Standing Long Jump-1.88",52,null,null,247,"Bronze","Bronze","Step 6","Step 6",null,null,247,"Gold","Silver","Step 8","Step 7"]
["Standing Long Jump-1.89",53,null,null,248,"Bronze","Bronze","Step 6","Step 6",null,null,248,"Gold","Silver","Step 8","Step 7"]
["Standing Long Jump-1.9",53,null,null,249,"Bronze","Bronze","Step 6","Step 6",null,null,249,"Gold","Silver","Step 8","Step 7"]
["Standing Long Jump-1.91",53,null,null,250,"Silver","Bronze","Step 6","Step 6",null,null,250,"Gold","Gold","Step 8","Step 7"]
["Standing Long Jump-1.92",54,null,null,251,"Silver","Bronze","Step 6","Step 6",null,null,251,"Gold","Gold","Step 8","Step 7"]
["Standing Long Jump-1.93",54,null,null,252,"Silver","Bronze","Step 6","Step 6",null,null,252,"Gold","Gold","Step 8","Step 7"]
["Standing Long Jump-1.94",54,null,null,253,"Silver","Bronze","Step 6","Step 6",null,null,253,"Gold","Gold","Step 8","Step 7"]
["Standing Long Jump-1.95",55,null,null,254,"Silver","Bronze","Step 6","Step 6",null,null,254,"Gold","Gold","Step 8","Step 7"]
["Standing Long Jump-1.96",55,null,null,255,"Silver","Bronze","Step 6","Step 6",null,null,255,"Gold","Gold","Step 8","Step 7"]
["Standing Long Jump-1.97",55,null,null,256,"Silver","Bronze","Step 6","Step 6",null,null,256,"Gold","Gold","Step 8","Step 7"]
["Standing Long Jump-1.98",56,null,null,257,"Silver","Bronze","Step 6","Step 6",null,null,257,"Gold","Gold","Step 8","Step 7"]
["Standing Long Jump-1.99",56,null,null,258,"Silver","Bronze","Step 6","Step 6",null,null,258,"Gold","Gold","Step 8","Step 7"]
["Standing Long Jump-2",56,null,null,259,"Silver","Bronze","Step 6","Step 6",null,null,259,"Gold","Gold","Step 8","Step 7"]
["Standing Long Jump-2.01",57,null,null,260,"Silver","Silver","Step 7","Step 6",null,null,260,"Gold","Gold","Step 8","Step 7"]
["Standing Long Jump-2.02",57,null,null,261,"Silver","Silver","Step 7","Step 6",null,null,261,"Gold","Gold","Step 8","Step 7"]
["Standing Long Jump-2.03",57,null,null,262,"Silver","Silver","Step 7","Step 6",null,null,262,"Gold","Gold","Step 8","Step 7"]
["Standing Long Jump-2.04",58,null,null,263,"Silver","Silver","Step 7","Step 6",null,null,263,"Gold","Gold","Step 8","Step 7"]
["Standing Long Jump-2.05",58,null,null,264,"Silver","Silver","Step 7","Step 6",null,null,264,"Gold","Gold","Step 8","Step 7"]
["Standing Long Jump-2.06",58,null,null,265,"Silver","Silver","Step 7","Step 6",null,null,265,"Gold","Gold","Step 8","Step 7"]
["Standing Long Jump-2.07",59,null,null,266,"Silver","Silver","Step 7","Step 6",null,null,266,"Gold","Gold","Step 8","Step 7"]
["Standing Long Jump-2.08",59,null,null,267,"Silver","Silver","Step 7","Step 6",null,null,267,"Gold","Gold","Step 8","Step 7"]
["Standing Long Jump-2.09",59,null,null,268,"Silver","Silver","Step 7","Step 6",null,null,268,"Gold","Gold","Step 8","Step 7"]
["Standing Long Jump-2.1",60,null,null,269,"Silver","Silver","Step 7","Step 6",null,null,269,"Gold","Gold","Step 8","Step 7"]
["Standing Long Jump-2.11",60,null,null,270,"Gold","Silver","Step 7","Step 6",null,null,270,"Gold","Gold","Step 9","Step 8"]
["Standing Long Jump-2.12",60,null,null,271,"Gold","Silver","Step 7","Step 6",null,null,271,"Gold","Gold","Step 9","Step 8"]
["Standing Long Jump-2.13",61,null,null,272,"Gold","Silver","Step 7","Step 6",null,null,272,"Gold","Gold","Step 9","Step 8"]
["Standing Long Jump-2.14",61,null,null,273,"Gold","Silver","Step 7","Step 6",null,null,273,"Gold","Gold","Step 9","Step 8"]
["Standing Long Jump-2.15",61,null,null,274,"Gold","Silver","Step 7","Step 6",null,null,274,"Gold","Gold","Step 9","Step 8"]
["Standing Long Jump-2.16",62,null,null,275,"Gold","Silver","Step 7","Step 6",null,null,275,"Gold","Gold","Step 9","Step 8"]
["Standing Long Jump-2.17",62,null,null,276,"Gold","Silver","Step 7","Step 6",null,null,276,"Gold","Gold","Step 9","Step 8"]
["Standing Long Jump-2.18",62,null,null,277,"Gold","Silver","Step 7","Step 6",null,null,277,"Gold","Gold","Step 9","Step 8"]
["Standing Long Jump-2.19",63,null,null,278,"Gold","Silver","Step 7","Step 6",null,null,278,"Gold","Gold","Step 9","Step 8"]
["Standing Long Jump-2.2",63,null,null,279,"Gold","Silver","Step 7","Step 6",null,null,279,"Gold","Gold","Step 9","Step 8"]
["Standing Long Jump-2.21",63,null,null,280,"Gold","Silver","Step 7","Step 7",null,null,280,"Gold","Gold","Step 9","Step 8"]
["Standing Long Jump-2.22",64,null,null,281,"Gold","Silver","Step 7","Step 7",null,null,281,"Gold","Gold","Step 9","Step 8"]
["Standing Long Jump-2.23",64,null,null,282,"Gold","Silver","Step 7","Step 7",null,null,282,"Gold","Gold","Step 9","Step 8"]
["Standing Long Jump-2.24",64,null,null,283,"Gold","Silver","Step 7","Step 7",null,null,283,"Gold","Gold","Step 9","Step 8"]
["Standing Long Jump-2.25",65,null,null,284,"Gold","Silver","Step 7","Step 7",null,null,284,"Gold","Gold","Step 9","Step 8"]
["Standing Long Jump-2.26",65,null,null,285,"Gold","Gold","Step 7","Step 7",null,null,285,"Gold","Gold","Step 9","Step 8"]
["Standing Long Jump-2.27",65,null,null,286,"Gold","Gold","Step 7","Step 7",null,null,286,"Gold","Gold","Step 9","Step 8"]
["Standing Long Jump-2.28",66,null,null,287,"Gold","Gold","Step 7","Step 7",null,null,287,"Gold","Gold","Step 9","Step 8"]
["Standing Long Jump-2.29",66,null,null,288,"Gold","Gold","Step 7","Step 7",null,null,288,"Gold","Gold","Step 9","Step 8"]
["Standing Long Jump-2.3",66,null,null,289,"Gold","Gold","Step 7","Step 7",null,null,289,"Gold","Gold","Step 9","Step 8"]
["Standing Long Jump-2.31",67,null,null,290,"Gold","Gold","Step 7","Step 7",null,null,290,"Gold","Gold","Step 9","Step 8"]
["Standing Long Jump-2.32",67,null,null,291,"Gold","Gold","Step 7","Step 7",null,null,291,"Gold","Gold","Step 9","Step 8"]
["Standing Long Jump-2.33",67,null,null,292,"Gold","Gold","Step 7","Step 7",null,null,292,"Gold","Gold","Step 9","Step 8"]
["Standing Long Jump-2.34",68,null,null,293,"Gold","Gold","Step 7","Step 7",null,null,293,"Gold","Gold","Step 9","Step 8"]
["Standing Long Jump-2.35",68,null,null,294,"Gold","Gold","Step 7","Step 7",null,null,294,"Gold","Gold","Step 9","Step 8"]
["Standing Long Jump-2.36",68,null,null,295,"Gold","Gold","Step 7","Step 7",null,null,295,"Gold","Gold","Step 9","Step 8"]
["Standing Long Jump-2.37",69,null,null,296,"Gold","Gold","Step 7","Step 7",null,null,296,"Gold","Gold","Step 9","Step 8"]
["Standing Long Jump-2.38",69,null,null,297,"Gold","Gold","Step 7","Step 7",null,null,297,"Gold","Gold","Step 9","Step 8"]
["Standing Long Jump-2.39",69,null,null,298,"Gold","Gold","Step 7","Step 7",null,null,298,"Gold","Gold","Step 9","Step 8"]
["Standing Long Jump-2.4",70,null,null,299,"Gold","Gold","Step 7","Step 7",null,null,299,"Gold","Gold","Step 9","Step 8"]
["Standing Long Jump-2.41",70,null,null,300,"Gold","Gold","Step 8","Step 7",null,null,300,"Gold","Gold","Step 9","Step 9"]
["Standing Long Jump-2.42",70,null,null,301,"Gold","Gold","Step 8","Step 7",null,null,301,"Gold","Gold","Step 9","Step 9"]
["Standing Long Jump-2.43",71,null,null,302,"Gold","Gold","Step 8","Step 7",null,null,302,"Gold","Gold","Step 9","Step 9"]
["Standing Long Jump-2.44",71,null,null,303,"Gold","Gold","Step 8","Step 7",null,null,303,"Gold","Gold","Step 9","Step 9"]
["Standing Long Jump-2.45",71,null,null,304,"Gold","Gold","Step 8","Step 7",null,null,304,"Gold","Gold","Step 9","Step 9"]
["Standing Long Jump-2.46",72,null,null,305,"Gold","Gold","Step 8","Step 7",null,null,305,"Gold","Gold","Step 9","Step 9"]
["Standing Long Jump-2.47",72,null,null,306,"Gold","Gold","Step 8","Step 7",null,null,306,"Gold","Gold","Step 9","Step 9"]
["Standing Long Jump-2.48",72,null,null,307,"Gold","Gold","Step 8","Step 7",null,null,307,"Gold","Gold","Step 9","Step 9"]
["Standing Long Jump-2.49",73,null,null,308,"Gold","Gold","Step 8","Step 7",null,null,308,"Gold","Gold","Step 9","Step 9"]
["Standing Long Jump-2.5",73,null,null,309,"Gold","Gold","Step 8","Step 7",null,null,309,"Gold","Gold","Step 9","Step 9"]
["Standing Long Jump-2.51",73,null,null,310,"Gold","Gold","Step 8","Step 7",null,null,310,"Gold","Gold","Step 9","Step 9"]
["Standing Long Jump-2.52",74,null,null,311,"Gold","Gold","Step 8","Step 7",null,null,311,"Gold","Gold","Step 9","Step 9"]
["Standing Long Jump-2.53",74,null,null,312,"Gold","Gold","Step 8","Step 7",null,null,312,"Gold","Gold","Step 9","Step 9"]
["Standing Long Jump-2.54",74,null,null,313,"Gold","Gold","Step 8","Step 7",null,null,313,"Gold","Gold","Step 9","Step 9"]
["Standing Long Jump-2.55",75,null,null,314,"Gold","Gold","Step 8","Step 7",null,null,314,"Gold","Gold","Step 9","Step 9"]
["Standing Long Jump-2.56",75,null,null,315,"Gold","Gold","Step 8","Step 7",null,null,315,"Gold","Gold","Step 10","Step 9"]
["Standing Long Jump-2.57",75,null,null,316,"Gold","Gold","Step 8","Step 7",null,null,316,"Gold","Gold","Step 10","Step 9"]
["Standing Long Jump-2.58",75,null,null,317,"Gold","Gold","Step 8","Step 7",null,null,317,"Gold","Gold","Step 10","Step 9"]
["Standing Long Jump-2.59",75,null,null,318,"Gold","Gold","Step 8","Step 7",null,null,318,"Gold","Gold","Step 10","Step 9"]
["Standing Long Jump-2.6",76,null,null,319,"Gold","Gold","Step 8","Step 7",null,null,319,"Gold","Gold","Step 10","Step 9"]
["Standing Long Jump-2.61",76,null,null,320,"Gold","Gold","Step 8","Step 8",null,null,320,"Gold","Gold","Step 10","Step 9"]
["Standing Long Jump-2.62",76,null,null,321,"Gold","Gold","Step 8","Step 8",null,null,321,"Gold","Gold","Step 10","Step 9"]
["Standing Long Jump-2.63",76,null,null,322,"Gold","Gold","Step 8","Step 8",null,null,322,"Gold","Gold","Step 10","Step 9"]
["Standing Long Jump-2.64",76,null,null,323,"Gold","Gold","Step 8","Step 8",null,null,323,"Gold","Gold","Step 10","Step 9"]
["Standing Long Jump-2.65",77,null,null,324,"Gold","Gold","Step 8","Step 8",null,null,324,"Gold","Gold","Step 10","Step 9"]
["Standing Long Jump-2.66",77,null,null,325,"Gold","Gold","Step 8","Step 8",null,null,325,"Gold","Gold","Step 10","Step 9"]
["Standing Long Jump-2.67",77,null,null,326,"Gold","Gold","Step 8","Step 8",null,null,326,"Gold","Gold","Step 10","Step 9"]
["Standing Long Jump-2.68",77,null,null,327,"Gold","Gold","Step 8","Step 8",null,null,327,"Gold","Gold","Step 10","Step 9"]
["Standing Long Jump-2.69",77,null,null,328,"Gold","Gold","Step 8","Step 8",null,null,328,"Gold","Gold","Step 10","Step 9"]
["Standing Long Jump-2.7",78,null,null,329,"Gold","Gold","Step 8","Step 8",null,null,329,"Gold","Gold","Step 10","Step 9"]
["Standing Long Jump-2.71",78,null,null,330,"Gold","Gold","Step 8","Step 8",null,null,330,"Gold","Gold","Step 10","Step 9"]
["Standing Long Jump-2.72",78,null,null,331,"Gold","Gold","Step 8","Step 8",null,null,331,"Gold","Gold","Step 10","Step 9"]
["Standing Long Jump-2.73",78,null,null,332,"Gold","Gold","Step 8","Step 8",null,null,332,"Gold","Gold","Step 10","Step 9"]
["Standing Long Jump-2.74",78,null,null,333,"Gold","Gold","Step 8","Step 8",null,null,333,"Gold","Gold","Step 10","Step 9"]
["Standing Long Jump-2.75",79,null,null,334,"Gold","Gold","Step 8","Step 8",null,null,334,"Gold","Gold","Step 10","Step 9"]
["Standing Long Jump-2.76",79,null,null,335,"Gold","Gold","Step 8","Step 8",null,null,335,"Gold","Gold","Step 10","Step 10"]
["Standing Long Jump-2.77",79,null,null,336,"Gold","Gold","Step 8","Step 8",null,null,336,"Gold","Gold","Step 10","Step 10"]
["Standing Long Jump-2.78",79,null,null,337,"Gold","Gold","Step 8","Step 8",null,null,337,"Gold","Gold","Step 10","Step 10"]
["Standing Long Jump-2.79",79,null,null,338,"Gold","Gold","Step 8","Step 8",null,null,338,"Gold","Gold","Step 10","Step 10"]
["Standing Long Jump-2.8",80,null,null,339,"Gold","Gold","Step 8","Step 8",null,null,339,"Gold","Gold","Step 10","Step 10"]
["Standing Long Jump-2.81",80,null,null,340,"Gold","Gold","Step 9","Step 8",null,null,340,"Gold","Gold","Step 10","Step 10"]
["Standing Long Jump-2.82",81,null,null,341,"Gold","Gold","Step 9","Step 8",null,null,341,"Gold","Gold","Step 10","Step 10"]
["Standing Long Jump-2.83",81,null,null,342,"Gold","Gold","Step 9","Step 8",null,null,342,"Gold","Gold","Step 10","Step 10"]
["Standing Long Jump-2.84",82,null,null,343,"Gold","Gold","Step 9","Step 8",null,null,343,"Gold","Gold","Step 10","Step 10"]
["Standing Long Jump-2.85",82,null,null,344,"Gold","Gold","Step 9","Step 8",null,null,344,"Gold","Gold","Step 10","Step 10"]
["Standing Long Jump-2.86",83,null,null,345,"Gold","Gold","Step 9","Step 8",null,null,345,"Gold","Gold","Step 10","Step 10"]
["Standing Long Jump-2.87",83,null,null,346,"Gold","Gold","Step 9","Step 8",null,null,346,"Gold","Gold","Step 10","Step 10"]
["Standing Long Jump-2.88",84,null,null,347,"Gold","Gold","Step 9","Step 8",null,null,347,"Gold","Gold","Step 10","Step 10"]
["Standing Long Jump-2.89",84,null,null,348,"Gold","Gold","Step 9","Step 8",null,null,348,"Gold","Gold","Step 10","Step 10"]
["Standing Long Jump-2.90",85,null,null,349,"Gold","Gold","Step 9","Step 8",null,null,349,"Gold","Gold","Step 10","Step 10"]
["Standing Long Jump-2.91",85,null,null,350,"Gold","Gold","Step 9","Step 8",null,null,350,"Gold","Gold","Bronze","Step 10"]
["Standing Long Jump-2.92",86,null,null,351,"Gold","Gold","Step 9","Step 8",null,null,351,"Gold","Gold","Bronze","Step 10"]
["Standing Long Jump-2.93",86,null,null,352,"Gold","Gold","Step 9","Step 8",null,null,352,"Gold","Gold","Bronze","Step 10"]
["Standing Long Jump-2.94",87,null,null,353,"Gold","Gold","Step 9","Step 8",null,null,353,"Gold","Gold","Bronze","Step 10"]
["Standing Long Jump-2.95",87,null,null,354,"Gold","Gold","Step 9","Step 8",null,null,354,"Gold","Gold","Bronze","Step 10"]
["Standing Long Jump-2.96",88,null,null,355,"Gold","Gold","Step 9","Step 8",null,null,355,"Gold","Gold","Bronze","Step 10"]
["Standing Long Jump-2.97",88,null,null,356,"Gold","Gold","Step 9","Step 8",null,null,356,"Gold","Gold","Bronze","Step 10"]
["Standing Long Jump-2.98",89,null,null,357,"Gold","Gold","Step 9","Step 8",null,null,357,"Gold","Gold","Bronze","Step 10"]
["Standing Long Jump-2.99",89,null,null,358,"Gold","Gold","Step 9","Step 8",null,null,358,"Gold","Gold","Bronze","Step 10"]
["Standing Long Jump-3.00",90,null,null,359,"Gold","Gold","Step 9","Step 8",null,null,359,"Gold","Gold","Bronze","Step 10"]
["Speed Bounce-1",1,null,null,360,"Gold","Gold","Step 9","Step 9",null,null,360,"Gold","Gold","Bronze","Step 10"]
["Speed Bounce-2",1,null,null,361,"Gold","Gold","Step 9","Step 9",null,null,361,"Gold","Gold","Bronze","Step 10"]
["Speed Bounce-3",1,null,null,362,"Gold","Gold","Step 9","Step 9",null,null,362,"Gold","Gold","Bronze","Step 10"]
["Speed Bounce-4",2,null,null,363,"Gold","Gold","Step 9","Step 9",null,null,363,"Gold","Gold","Bronze","Step 10"]
["Speed Bounce-5",2,null,null,364,"Gold","Gold","Step 9","Step 9",null,null,364,"Gold","Gold","Bronze","Step 10"]
["Speed Bounce-6",3,null,null,365,"Gold","Gold","Step 9","Step 9",null,null,365,"Gold","Gold","Bronze","Step 10"]
["Speed Bounce-7",3,null,null,366,"Gold","Gold","Step 9","Step 9",null,null,366,"Gold","Gold","Bronze","Step 10"]
["Speed Bounce-8",4,null,null,367,"Gold","Gold","Step 9","Step 9",null,null,367,"Gold","Gold","Bronze","Step 10"]
["Speed Bounce-9",5,null,null,368,"Gold","Gold","Step 9","Step 9",null,null,368,"Gold","Gold","Bronze","Step 10"]
["Speed Bounce-10",6,null,null,369,"Gold","Gold","Step 9","Step 9",null,null,369,"Gold","Gold","Bronze","Step 10"]
["Speed Bounce-11",7,null,null,370,"Gold","Gold","Step 9","Step 9",null,null,370,"Gold","Gold","Bronze","Bronze"]
["Speed Bounce-12",8,null,null,371,"Gold","Gold","Step 9","Step 9",null,null,371,"Gold","Gold","Bronze","Bronze"]
["Speed Bounce-13",9,null,null,372,"Gold","Gold","Step 9","Step 9",null,null,372,"Gold","Gold","Bronze","Bronze"]
["Speed Bounce-14",10,null,null,373,"Gold","Gold","Step 9","Step 9",null,null,373,"Gold","Gold","Bronze","Bronze"]
["Speed Bounce-15",11,null,null,374,"Gold","Gold","Step 9","Step 9",null,null,374,"Gold","Gold","Bronze","Bronze"]
["Speed Bounce-16",12,null,null,375,"Gold","Gold","Step 9","Step 9",null,null,375,"Gold","Gold","Bronze","Bronze"]
["Speed Bounce-17",13,null,null,376,"Gold","Gold","Step 9","Step 9",null,null,376,"Gold","Gold","Bronze","Bronze"]
["Speed Bounce-18",14,null,null,377,"Gold","Gold","Step 9","Step 9",null,null,377,"Gold","Gold","Bronze","Bronze"]
["Speed Bounce-19",15,null,null,378,"Gold","Gold","Step 9","Step 9",null,null,378,"Gold","Gold","Bronze","Bronze"]
["Speed Bounce-20",16,null,null,379,"Gold","Gold","Step 9","Step 9",null,null,379,"Gold","Gold","Bronze","Bronze"]
["Speed Bounce-21",17,null,null,380,"Gold","Gold","Step 10","Step 9",null,null,380,"Gold","Gold","Bronze","Bronze"]
["Speed Bounce-22",19,null,null,381,"Gold","Gold","Step 10","Step 9",null,null,381,"Gold","Gold","Bronze","Bronze"]
["Speed Bounce-23",20,null,null,382,"Gold","Gold","Step 10","Step 9",null,null,382,"Gold","Gold","Bronze","Bronze"]
["Speed Bounce-24",21,null,null,383,"Gold","Gold","Step 10","Step 9",null,null,383,"Gold","Gold","Bronze","Bronze"]
["Speed Bounce-25",22,null,null,384,"Gold","Gold","Step 10","Step 9",null,null,384,"Gold","Gold","Bronze","Bronze"]
["Speed Bounce-26",24,null,null,385,"Gold","Gold","Step 10","Step 9",null,null,385,"Gold","Gold","Bronze","Bronze"]
["Speed Bounce-27",25,null,null,386,"Gold","Gold","Step 10","Step 9",null,null,386,"Gold","Gold","Bronze","Bronze"]
["Speed Bounce-28",26,null,null,387,"Gold","Gold","Step 10","Step 9",null,null,387,"Gold","Gold","Bronze","Bronze"]
["Speed Bounce-29",27,null,null,388,"Gold","Gold","Step 10","Step 9",null,null,388,"Gold","Gold","Bronze","Bronze"]
["Speed Bounce-30",28,null,null,389,"Gold","Gold","Step 10","Step 9",null,null,389,"Gold","Gold","Bronze","Bronze"]
["Speed Bounce-31",29,null,null,390,"Gold","Gold","Step 10","Step 9",null,null,390,"Gold","Gold","Bronze","Bronze"]
["Speed Bounce-32",30,null,null,391,"Gold","Gold","Step 10","Step 9",null,null,391,"Gold","Gold","Bronze","Bronze"]
["Speed Bounce-33",31,null,null,392,"Gold","Gold","Step 10","Step 9",null,null,392,"Gold","Gold","Bronze","Bronze"]
["Speed Bounce-34",32,null,null,393,"Gold","Gold","Step 10","Step 9",null,null,393,"Gold","Gold","Bronze","Bronze"]
["Speed Bounce-35",33,null,null,394,"Gold","Gold","Step 10","Step 9",null,null,394,"Gold","Gold","Bronze","Bronze"]
["Speed Bounce-36",34,null,null,395,"Gold","Gold","Step 10","Step 9",null,null,395,"Gold","Gold","Bronze","Bronze"]
["Speed Bounce-37",35,null,null,396,"Gold","Gold","Step 10","Step 9",null,null,396,"Gold","Gold","Bronze","Bronze"]
["Speed Bounce-38",36,null,null,397,"Gold","Gold","Step 10","Step 9",null,null,397,"Gold","Gold","Bronze","Bronze"]
["Speed Bounce-39",37,null,null,398,"Gold","Gold","Step 10","Step 9",null,null,398,"Gold","Gold","Bronze","Bronze"]
["Speed Bounce-40",38,null,null,399,"Gold","Gold","Step 10","Step 9",null,null,399,"Gold","Gold","Bronze","Bronze"]
["Speed Bounce-41",39,null,null,400,"Gold","Gold","Step 10","Step 10",null,null,400,"Gold","Gold","Bronze","Bronze"]
["Speed Bounce-42",40,null,null,401,null,null,"Step 10","Step 10",null,null,401,null,null,"Bronze","Bronze"]
["Speed Bounce-43",41,null,null,402,null,null,"Step 10","Step 10",null,null,402,null,null,"Bronze","Bronze"]
["Speed Bounce-44",42,null,null,403,null,null,"Step 10","Step 10",null,null,403,null,null,"Bronze","Bronze"]
["Speed Bounce-45",43,null,null,404,null,null,"Step 10","Step 10",null,null,404,null,null,"Bronze","Bronze"]
["Speed Bounce-46",44,null,null,405,null,null,"Step 10","Step 10",null,null,405,null,null,"Bronze","Bronze"]
["Speed Bounce-47",45,null,null,406,null,null,"Step 10","Step 10",null,null,406,null,null,"Bronze","Bronze"]
["Speed Bounce-48",47,null,null,407,null,null,"Step 10","Step 10",null,null,407,null,null,"Bronze","Bronze"]
["Speed Bounce-49",49,null,null,408,null,null,"Step 10","Step 10",null,null,408,null,null,"Bronze","Bronze"]
["Speed Bounce-50",50,null,null,409,null,null,"Step 10","Step 10",null,null,409,null,null,"Bronze","Bronze"]
["Speed Bounce-51",51,null,null,410,null,null,"Step 10","Step 10",null,null,410,null,null,"Bronze","Bronze"]
["Speed Bounce-52",52,null,null,411,null,null,"Step 10","Step 10",null,null,411,null,null,"Bronze","Bronze"]
["Speed Bounce-53",53,null,null,412,null,null,"Step 10","Step 10",null,null,412,null,null,"Bronze","Bronze"]
["Speed Bounce-54",54,null,null,413,null,null,"Step 10","Step 10",null,null,413,null,null,"Bronze","Bronze"]
["Speed Bounce-55",55,null,null,414,null,null,"Step 10","Step 10",null,null,414,null,null,"Bronze","Bronze"]
["Speed Bounce-56",56,null,null,415,null,null,"Step 10","Step 10",null,null,415,null,null,"Bronze","Bronze"]
["Speed Bounce-57",57,null,null,416,null,null,"Step 10","Step 10",null,null,416,null,null,"Bronze","Bronze"]
["Speed Bounce-58",58,null,null,417,null,null,"Step 10","Step 10",null,null,417,null,null,"Bronze","Bronze"]
["Speed Bounce-59",59,null,null,418,null,null,"Step 10","Step 10",null,null,418,null,null,"Bronze","Bronze"]
["Speed Bounce-60",60,null,null,419,null,null,"Step 10","Step 10",null,null,419,null,null,"Bronze","Bronze"]
["Speed Bounce-61",61,null,null,420,null,null,"Bronze","Step 10",null,null,420,null,null,"Silver","Bronze"]
["Speed Bounce-62",62,null,null,421,null,null,"Bronze","Step 10",null,null,421,null,null,"Silver","Bronze"]
["Speed Bounce-63",63,null,null,422,null,null,"Bronze","Step 10",null,null,422,null,null,"Silver","Bronze"]
["Speed Bounce-64",64,null,null,423,null,null,"Bronze","Step 10",null,null,423,null,null,"Silver","Bronze"]
["Speed Bounce-65",65,null,null,424,null,null,"Bronze","Step 10",null,null,424,null,null,"Silver","Bronze"]
["Speed Bounce-66",66,null,null,425,null,null,"Bronze","Step 10",null,null,425,null,null,"Silver","Bronze"]
["Speed Bounce-67",67,null,null,426,null,null,"Bronze","Step 10",null,null,426,null,null,"Silver","Bronze"]
["Speed Bounce-68",68,null,null,427,null,null,"Bronze","Step 10",null,null,427,null,null,"Silver","Bronze"]
["Speed Bounce-69",69,null,null,428,null,null,"Bronze","Step 10",null,null,428,null,null,"Silver","Bronze"]
["Speed Bounce-70",70,null,null,429,null,null,"Bronze","Step 10",null,null,429,null,null,"Silver","Bronze"]
["Speed Bounce-71",71,null,null,430,null,null,"Bronze","Step 10",null,null,430,null,null,"Silver","Bronze"]
["Speed Bounce-72",72,null,null,431,null,null,"Bronze","Step 10",null,null,431,null,null,"Silver","Bronze"]
["Speed Bounce-73",73,null,null,432,null,null,"Bronze","Step 10",null,null,432,null,null,"Silver","Bronze"]
["Speed Bounce-74",74,null,null,433,null,null,"Bronze","Step 10",null,null,433,null,null,"Silver","Bronze"]
["Speed Bounce-75",75,null,null,434,null,null,"Bronze","Step 10",null,null,434,null,null,"Silver","Bronze"]
["Speed Bounce-76",76,null,null,435,null,null,"Bronze","Step 10",null,null,435,null,null,"Silver","Bronze"]
["Speed Bounce-77",77,null,null,436,null,null,"Bronze","Step 10",null,null,436,null,null,"Silver","Bronze"]
["Speed Bounce-78",78,null,null,437,null,null,"Bronze","Step 10",null,null,437,null,null,"Silver","Bronze"]
["Speed Bounce-79",79,null,null,438,null,null,"Bronze","Step 10",null,null,438,null,null,"Silver","Bronze"]
["Speed Bounce-80",80,null,null,439,null,null,"Bronze","Step 10",null,null,439,null,null,"Silver","Bronze"]
["Target Throw-0",0,null,null,440,null,null,"Bronze","Bronze",null,null,440,null,null,"Silver","Silver"]
["Target Throw-1",3,null,null,441,null,null,"Bronze","Bronze",null,null,441,null,null,"Silver","Silver"]
["Target Throw-2",6,null,null,442,null,null,"Bronze","Bronze",null,null,442,null,null,"Silver","Silver"]
["Target Throw-3",9,null,null,443,null,null,"Bronze","Bronze",null,null,443,null,null,"Silver","Silver"]
["Target Throw-4",12,null,null,444,null,null,"Bronze","Bronze",null,null,444,null,null,"Silver","Silver"]
["Target Throw-5",15,null,null,445,null,null,"Bronze","Bronze",null,null,445,null,null,"Silver","Silver"]
["Target Throw-6",18,null,null,446,null,null,"Bronze","Bronze",null,null,446,null,null,"Silver","Silver"]
["Target Throw-7",21,null,null,447,null,null,"Bronze","Bronze",null,null,447,null,null,"Silver","Silver"]
["Target Throw-8",24,null,null,448,null,null,"Bronze","Bronze",null,null,448,null,null,"Silver","Silver"]
["Target Throw-9",27,null,null,449,null,null,"Bronze","Bronze",null,null,449,null,null,"Silver","Silver"]
["Target Throw-10",30,null,null,450,null,null,"Bronze","Bronze",null,null,450,null,null,"Silver","Silver"]
["Target Throw-11",33,null,null,451,null,null,"Bronze","Bronze",null,null,451,null,null,"Silver","Silver"]
["Target Throw-12",36,null,null,452,null,null,"Bronze","Bronze",null,null,452,null,null,"Silver","Silver"]
["Target Throw-13",39,null,null,453,null,null,"Bronze","Bronze",null,null,453,null,null,"Silver","Silver"]
["Target Throw-14",42,null,null,454,null,null,"Bronze","Bronze",null,null,454,null,null,"Silver","Silver"]
["Target Throw-15",45,null,null,455,null,null,"Bronze","Bronze",null,null,455,null,null,"Silver","Silver"]
["Target Throw-16",48,null,null,456,null,null,"Bronze","Bronze",null,null,456,null,null,"Silver","Silver"]
["Target Throw-17",51,null,null,457,null,null,"Bronze","Bronze",null,null,457,null,null,"Silver","Silver"]
["Target Throw-18",54,null,null,458,null,null,"Bronze","Bronze",null,null,458,null,null,"Silver","Silver"]
["Target Throw-19",57,null,null,459,null,null,"Bronze","Bronze",null,null,459,null,null,"Silver","Silver"]
["Target Throw-20",60,null,null,460,null,null,"Bronze","Bronze",null,null,460,null,null,"Gold","Silver"]
["Target Throw-21",63,null,null,461,null,null,"Bronze","Bronze",null,null,461,null,null,"Gold","Silver"]
["Target Throw-22",66,null,null,462,null,null,"Bronze","Bronze",null,null,462,null,null,"Gold","Silver"]
["Target Throw-23",69,null,null,463,null,null,"Bronze","Bronze",null,null,463,null,null,"Gold","Silver"]
["Target Throw-24",72,null,null,464,null,null,"Bronze","Bronze",null,null,464,null,null,"Gold","Silver"]
["Overhead Heave-14",98,null,null,465,null,null,"Bronze","Bronze",null,null,465,null,null,"Gold","Silver"]
["Overhead Heave-13.75",96,null,null,466,null,null,"Bronze","Bronze",null,null,466,null,null,"Gold","Silver"]
["Overhead Heave-13.5",94,null,null,467,null,null,"Bronze","Bronze",null,null,467,null,null,"Gold","Silver"]
["Overhead Heave-13.25",92,null,null,468,null,null,"Bronze","Bronze",null,null,468,null,null,"Gold","Silver"]
["Overhead Heave-13",90,null,null,469,null,null,"Bronze","Bronze",null,null,469,null,null,"Gold","Silver"]
["Overhead Heave-12.75",88,null,null,470,null,null,"Silver","Bronze",null,null,470,null,null,"Gold","Silver"]
["Overhead Heave-12.5",86,null,null,471,null,null,"Silver","Bronze",null,null,471,null,null,"Gold","Silver"]
["Overhead Heave-12.25",84,null,null,472,null,null,"Silver","Bronze",null,null,472,null,null,"Gold","Silver"]
["Overhead Heave-12",80,null,null,473,null,null,"Silver","Bronze",null,null,473,null,null,"Gold","Silver"]
["Overhead Heave-11.75",78,null,null,474,null,null,"Silver","Bronze",null,null,474,null,null,"Gold","Silver"]
["Overhead Heave-11.5",76,null,null,475,null,null,"Silver","Bronze",null,null,475,null,null,"Gold","Silver"]
["Overhead Heave-11.25",74,null,null,476,null,null,"Silver","Bronze",null,null,476,null,null,"Gold","Silver"]
["Overhead Heave-11",72,null,null,477,null,null,"Silver","Bronze",null,null,477,null,null,"Gold","Silver"]
["Overhead Heave-10.75",70,null,null,478,null,null,"Silver","Bronze",null,null,478,null,null,"Gold","Silver"]
["Overhead Heave-10.5",68,null,null,479,null,null,"Silver","Bronze",null,null,479,null,null,"Gold","Silver"]
["Overhead Heave-10.25",66,null,null,480,null,null,"Silver","Bronze",null,null,480,null,null,"Gold","Gold"]
["Overhead Heave-10",64,null,null,481,null,null,"Silver","Bronze",null,null,481,null,null,"Gold","Gold"]
["Overhead Heave-9.75",63,null,null,482,null,null,"Silver","Bronze",null,null,482,null,null,"Gold","Gold"]
["Overhead Heave-9.5",61,null,null,483,null,null,"Silver","Bronze",null,null,483,null,null,"Gold","Gold"]
["Overhead Heave-9.25",60,null,null,484,null,null,"Silver","Bronze",null,null,484,null,null,"Gold","Gold"]
["Overhead Heave-9",58,null,null,485,null,null,"Silver","Bronze",null,null,485,null,null,"Gold","Gold"]
["Overhead Heave-8.75",57,null,null,486,null,null,"Silver","Bronze",null,null,486,null,null,"Gold","Gold"]
["Overhead Heave-8.5",55,null,null,487,null,null,"Silver","Bronze",null,null,487,null,null,"Gold","Gold"]
["Overhead Heave-8.25",54,null,null,488,null,null,"Silver","Bronze",null,null,488,null,null,"Gold","Gold"]
["Overhead Heave-8",53,null,null,489,null,null,"Silver","Bronze",null,null,489,null,null,"Gold","Gold"]
["Overhead Heave-7.75",52,null,null,490,null,null,"Silver","Silver",null,null,490,null,null,"Gold","Gold"]
["Overhead Heave-7.5",50,null,null,491,null,null,"Silver","Silver",null,null,491,null,null,"Gold","Gold"]
["Overhead Heave-7.25",49,null,null,492,null,null,"Silver","Silver",null,null,492,null,null,"Gold","Gold"]
["Overhead Heave-7",47,null,null,493,null,null,"Silver","Silver",null,null,493,null,null,"Gold","Gold"]
["Overhead Heave-6.75",46,null,null,494,null,null,"Silver","Silver",null,null,494,null,null,"Gold","Gold"]
["Overhead Heave-6.5",44,null,null,495,null,null,"Silver","Silver",null,null,495,null,null,"Gold","Gold"]
["Overhead Heave-6.25",42,null,null,496,null,null,"Silver","Silver",null,null,496,null,null,"Gold","Gold"]
["Overhead Heave-6",40,null,null,497,null,null,"Silver","Silver",null,null,497,null,null,"Gold","Gold"]
["Overhead Heave-5.75",38,null,null,498,null,null,"Silver","Silver",null,null,498,null,null,"Gold","Gold"]
["Overhead Heave-5.5",36,null,null,499,null,null,"Silver","Silver",null,null,499,null,null,"Gold","Gold"]
["Overhead Heave-5.25",33,null,null,500,null,null,"Silver","Silver",null,null,500,null,null,"Gold","Gold"]
["Overhead Heave-5",31,null,null,501,null,null,"Silver","Silver",null,null,501,null,null,"Gold","Gold"]
["Overhead Heave-4.75",29,null,null,502,null,null,"Silver","Silver",null,null,502,null,null,"Gold","Gold"]
["Overhead Heave-4.5",27,null,null,503,null,null,"Silver","Silver",null,null,503,null,null,"Gold","Gold"]
["Overhead Heave-4.25",25,null,null,504,null,null,"Silver","Silver",null,null,504,null,null,"Gold","Gold"]
["Overhead Heave-4",22,null,null,505,null,null,"Silver","Silver",null,null,505,null,null,"Gold","Gold"]
["Overhead Heave-3.75",19,null,null,506,null,null,"Silver","Silver",null,null,506,null,null,"Gold","Gold"]
["Overhead Heave-3.5",16,null,null,507,null,null,"Silver","Silver",null,null,507,null,null,"Gold","Gold"]
["Overhead Heave-3.25",13,null,null,508,null,null,"Silver","Silver",null,null,508,null,null,"Gold","Gold"]
["Overhead Heave-3",10,null,null,509,null,null,"Silver","Silver",null,null,509,null,null,"Gold","Gold"]
["Overhead Heave-2.75",8,null,null,510,null,null,"Gold","Silver",null,null,510,null,null,"Gold","Gold"]
["Overhead Heave-2.5",6,null,null,511,null,null,"Gold","Silver",null,null,511,null,null,"Gold","Gold"]
["Overhead Heave-2.25",4,null,null,512,null,null,"Gold","Silver",null,null,512,null,null,"Gold","Gold"]
["Overhead Heave-2",4,null,null,513,null,null,"Gold","Silver",null,null,513,null,null,"Gold","Gold"]
["Overhead Heave-1.75",1,null,null,514,null,null,"Gold","Silver",null,null,514,null,null,"Gold","Gold"]
["Overhead Heave-1.5",1,null,null,515,null,null,"Gold","Silver",null,null,515,null,null,"Gold","Gold"]
["Overhead Heave-1.25",1,null,null,516,null,null,"Gold","Silver",null,null,516,null,null,"Gold","Gold"]
["Overhead Heave-1",1,null,null,517,null,null,"Gold","Silver",null,null,517,null,null,"Gold","Gold"]
["Overhead Heave-0.75",1,null,null,518,null,null,"Gold","Silver",null,null,518,null,null,"Gold","Gold"]
["Overhead Heave-0.5",1,null,null,519,null,null,"Gold","Silver",null,null,519,null,null,"Gold","Gold"]
["Overhead Heave-0.25",1,null,null,520,null,null,"Gold","Silver",null,null,520,null,null,"Gold","Gold"]
["Hi-Stepper-10.1",98,null,null,521,null,null,"Gold","Silver",null,null,521,null,null,"Gold","Gold"]
["Hi-Stepper-10.2",96,null,null,522,null,null,"Gold","Silver",null,null,522,null,null,"Gold","Gold"]
["Hi-Stepper-10.3",94,null,null,523,null,null,"Gold","Silver",null,null,523,null,null,"Gold","Gold"]
["Hi-Stepper-10.4",92,null,null,524,null,null,"Gold","Silver",null,null,524,null,null,"Gold","Gold"]
["Hi-Stepper-10.5",90,null,null,525,null,null,"Gold","Silver",null,null,525,null,null,"Gold","Gold"]
["Hi-Stepper-10.6",88,null,null,526,null,null,"Gold","Silver",null,null,526,null,null,"Gold","Gold"]
["Hi-Stepper-10.7",86,null,null,527,null,null,"Gold","Silver",null,null,527,null,null,"Gold","Gold"]
["Hi-Stepper-10.8",84,null,null,528,null,null,"Gold","Silver",null,null,528,null,null,"Gold","Gold"]
["Hi-Stepper-10.9",82,null,null,529,null,null,"Gold","Silver",null,null,529,null,null,"Gold","Gold"]
["Hi-Stepper-11",80,null,null,530,null,null,"Gold","Silver",null,null,530,null,null,"Gold","Gold"]
["Hi-Stepper-11.1",79,null,null,531,null,null,"Gold","Silver",null,null,531,null,null,"Gold","Gold"]
["Hi-Stepper-11.2",79,null,null,532,null,null,"Gold","Silver",null,null,532,null,null,"Gold","Gold"]
["Hi-Stepper-11.3",78,null,null,533,null,null,"Gold","Silver",null,null,533,null,null,"Gold","Gold"]
["Hi-Stepper-11.4",78,null,null,534,null,null,"Gold","Silver",null,null,534,null,null,"Gold","Gold"]
["Hi-Stepper-11.5",77,null,null,535,null,null,"Gold","Silver",null,null,535,null,null,"Gold","Gold"]
["Hi-Stepper-11.6",77,null,null,536,null,null,"Gold","Silver",null,null,536,null,null,"Gold","Gold"]
["Hi-Stepper-11.7",76,null,null,537,null,null,"Gold","Silver",null,null,537,null,null,"Gold","Gold"]
["Hi-Stepper-11.8",76,null,null,538,null,null,"Gold","Silver",null,null,538,null,null,"Gold","Gold"]
["Hi-Stepper-11.9",75,null,null,539,null,null,"Gold","Silver",null,null,539,null,null,"Gold","Gold"]
["Hi-Stepper-12",75,null,null,540,null,null,"Gold","Gold",null,null,540,null,null,"Gold","Gold"]
["Hi-Stepper-12.1",74,null,null,541,null,null,"Gold","Gold",null,null,541,null,null,"Gold","Gold"]
["Hi-Stepper-12.2",74,null,null,542,null,null,"Gold","Gold",null,null,542,null,null,"Gold","Gold"]
["Hi-Stepper-12.3",73,null,null,543,null,null,"Gold","Gold",null,null,543,null,null,"Gold","Gold"]
["Hi-Stepper-12.4",73,null,null,544,null,null,"Gold","Gold",null,null,544,null,null,"Gold","Gold"]
["Hi-Stepper-12.5",72,null,null,545,null,null,"Gold","Gold",null,null,545,null,null,"Gold","Gold"]
["Hi-Stepper-12.6",71,null,null,546,null,null,"Gold","Gold",null,null,546,null,null,"Gold","Gold"]
["Hi-Stepper-12.7",70,null,null,547,null,null,"Gold","Gold",null,null,547,null,null,"Gold","Gold"]
["Hi-Stepper-12.8",69,null,null,548,null,null,"Gold","Gold",null,null,548,null,null,"Gold","Gold"]
["Hi-Stepper-12.9",68,null,null,549,null,null,"Gold","Gold",null,null,549,null,null,"Gold","Gold"]
["Hi-Stepper-13",67,null,null,550,null,null,"Gold","Gold",null,null,550,null,null,"Gold","Gold"]
["Hi-Stepper-13.1",66,null,null,551,null,null,"Gold","Gold",null,null,551,null,null,"Gold","Gold"]
["Hi-Stepper-13.2",65,null,null,552,null,null,"Gold","Gold",null,null,552,null,null,"Gold","Gold"]
["Hi-Stepper-13.3",64,null,null,553,null,null,"Gold","Gold",null,null,553,null,null,"Gold","Gold"]
["Hi-Stepper-13.4",63,null,null,554,null,null,"Gold","Gold",null,null,554,null,null,"Gold","Gold"]
["Hi-Stepper-13.5",62,null,null,555,null,null,"Gold","Gold",null,null,555,null,null,"Gold","Gold"]
["Hi-Stepper-13.6",61,null,null,556,null,null,"Gold","Gold",null,null,556,null,null,"Gold","Gold"]
["Hi-Stepper-13.7",60,null,null,557,null,null,"Gold","Gold",null,null,557,null,null,"Gold","Gold"]
["Hi-Stepper-13.8",59,null,null,558,null,null,"Gold","Gold",null,null,558,null,null,"Gold","Gold"]
["Hi-Stepper-13.9",58,null,null,559,null,null,"Gold","Gold",null,null,559,null,null,"Gold","Gold"]
["Hi-Stepper-14",57,null,null,560,null,null,"Gold","Gold",null,null,560,null,null,"Gold","Gold"]
["Hi-Stepper-14.1",56,null,null,561,null,null,"Gold","Gold",null,null,561,null,null,"Gold","Gold"]
["Hi-Stepper-14.2",55,null,null,562,null,null,"Gold","Gold",null,null,562,null,null,"Gold","Gold"]
["Hi-Stepper-14.3",54,null,null,563,null,null,"Gold","Gold",null,null,563,null,null,"Gold","Gold"]
["Hi-Stepper-14.4",53,null,null,564,null,null,"Gold","Gold",null,null,564,null,null,"Gold","Gold"]
["Hi-Stepper-14.5",52,null,null,565,null,null,"Gold","Gold",null,null,565,null,null,"Gold","Gold"]
["Hi-Stepper-14.6",51,null,null,566,null,null,"Gold","Gold",null,null,566,null,null,"Gold","Gold"]
["Hi-Stepper-14.7",50,null,null,567,null,null,"Gold","Gold",null,null,567,null,null,"Gold","Gold"]
["Hi-Stepper-14.8",49,null,null,568,null,null,"Gold","Gold",null,null,568,null,null,"Gold","Gold"]
["Hi-Stepper-14.9",48,null,null,569,null,null,"Gold","Gold",null,null,569,null,null,"Gold","Gold"]
["Hi-Stepper-15",47,null,null,570,null,null,"Gold","Gold",null,null,570,null,null,"Gold","Gold"]
["Hi-Stepper-15.1",46,null,null,571,null,null,"Gold","Gold",null,null,571,null,null,"Gold","Gold"]
["Hi-Stepper-15.2",45,null,null,572,null,null,"Gold","Gold",null,null,572,null,null,"Gold","Gold"]
["Hi-Stepper-15.3",44,null,null,573,null,null,"Gold","Gold",null,null,573,null,null,"Gold","Gold"]
["Hi-Stepper-15.4",43,null,null,574,null,null,"Gold","Gold",null,null,574,null,null,"Gold","Gold"]
["Hi-Stepper-15.5",42,null,null,575,null,null,"Gold","Gold",null,null,575,null,null,"Gold","Gold"]
["Hi-Stepper-15.6",41,null,null,576,null,null,"Gold","Gold",null,null,576,null,null,"Gold","Gold"]
["Hi-Stepper-15.7",40,null,null,577,null,null,"Gold","Gold",null,null,577,null,null,"Gold","Gold"]
["Hi-Stepper-15.8",39,null,null,578,null,null,"Gold","Gold",null,null,578,null,null,"Gold","Gold"]
["Hi-Stepper-15.9",38,null,null,579,null,null,"Gold","Gold",null,null,579,null,null,"Gold","Gold"]
["Hi-Stepper-16",37,null,null,580,null,null,"Gold","Gold",null,null,580,null,null,"Gold","Gold"]
["Hi-Stepper-16.1",36,null,null,581,null,null,"Gold","Gold",null,null,581,null,null,"Gold","Gold"]
["Hi-Stepper-16.2",35,null,null,582,null,null,"Gold","Gold",null,null,582,null,null,"Gold","Gold"]
["Hi-Stepper-16.3",34,null,null,583,null,null,"Gold","Gold",null,null,583,null,null,"Gold","Gold"]
["Hi-Stepper-16.4",33,null,null,584,null,null,"Gold","Gold",null,null,584,null,null,"Gold","Gold"]
["Hi-Stepper-16.5",32,null,null,585,null,null,"Gold","Gold",null,null,585,null,null,"Gold","Gold"]
["Hi-Stepper-16.6",31,null,null,586,null,null,"Gold","Gold",null,null,586,null,null,"Gold","Gold"]
["Hi-Stepper-16.7",30,null,null,587,null,null,"Gold","Gold",null,null,587,null,null,"Gold","Gold"]
["Hi-Stepper-16.8",30,null,null,588,null,null,"Gold","Gold",null,null,588,null,null,"Gold","Gold"]
["Hi-Stepper-16.9",29,null,null,589,null,null,"Gold","Gold",null,null,589,null,null,"Gold","Gold"]
["Hi-Stepper-17",29,null,null,590,null,null,"Gold","Gold",null,null,590,null,null,"Gold","Gold"]
["Hi-Stepper-17.1",28,null,null,591,null,null,"Gold","Gold",null,null,591,null,null,"Gold","Gold"]
["Hi-Stepper-17.2",28,null,null,592,null,null,"Gold","Gold",null,null,592,null,null,"Gold","Gold"]
["Hi-Stepper-17.3",27,null,null,593,null,null,"Gold","Gold",null,null,593,null,null,"Gold","Gold"]
["Hi-Stepper-17.4",27,null,null,594,null,null,"Gold","Gold",null,null,594,null,null,"Gold","Gold"]
["Hi-Stepper-17.5",26,null,null,595,null,null,"Gold","Gold",null,null,595,null,null,"Gold","Gold"]
["Hi-Stepper-17.6",26,null,null,596,null,null,"Gold","Gold",null,null,596,null,null,"Gold","Gold"]
["Hi-Stepper-17.7",25,null,null,597,null,null,"Gold","Gold",null,null,597,null,null,"Gold","Gold"]
["Hi-Stepper-17.8",25,null,null,598,null,null,"Gold","Gold",null,null,598,null,null,"Gold","Gold"]
["Hi-Stepper-17.9",25,null,null,599,null,null,"Gold","Gold",null,null,599,null,null,"Gold","Gold"]
["Hi-Stepper-18",25,null,null,600,null,null,"Gold","Gold",null,null,600,null,null,"Gold","Gold"]
["Hi-Stepper-18.1",24,null,null,601,null,null,"Gold","Gold",null,null,601,null,null,"Gold","Gold"]
["Hi-Stepper-18.2",24,null,null,602,null,null,"Gold","Gold",null,null,602,null,null,"Gold","Gold"]
["Hi-Stepper-18.3",24,null,null,603,null,null,"Gold","Gold",null,null,603,null,null,"Gold","Gold"]
["Hi-Stepper-18.4",23,null,null,604,null,null,"Gold","Gold",null,null,604,null,null,"Gold","Gold"]
["Hi-Stepper-18.5",23,null,null,605,null,null,"Gold","Gold",null,null,605,null,null,"Gold","Gold"]
["Hi-Stepper-18.6",23,null,null,606,null,null,"Gold","Gold",null,null,606,null,null,"Gold","Gold"]
["Hi-Stepper-18.7",22,null,null,607,null,null,"Gold","Gold",null,null,607,null,null,"Gold","Gold"]
["Hi-Stepper-18.8",22,null,null,608,null,null,"Gold","Gold",null,null,608,null,null,"Gold","Gold"]
["Hi-Stepper-18.9",22,null,null,609,null,null,"Gold","Gold",null,null,609,null,null,"Gold","Gold"]
["Hi-Stepper-19",21,null,null,610,null,null,"Gold","Gold",null,null,610,null,null,"Gold","Gold"]
["Hi-Stepper-19.1",21,null,null,611,null,null,"Gold","Gold",null,null,611,null,null,"Gold","Gold"]
["Hi-Stepper-19.2",21,null,null,612,null,null,"Gold","Gold",null,null,612,null,null,"Gold","Gold"]
["Hi-Stepper-19.3",20,null,null,613,null,null,"Gold","Gold",null,null,613,null,null,"Gold","Gold"]
["Hi-Stepper-19.4",20,null,null,614,null,null,"Gold","Gold",null,null,614,null,null,"Gold","Gold"]
["Hi-Stepper-19.5",20,null,null,615,null,null,"Gold","Gold",null,null,615,null,null,"Gold","Gold"]
["Hi-Stepper-19.6",20,null,null,616,null,null,"Gold","Gold",null,null,616,null,null,"Gold","Gold"]
["Hi-Stepper-19.7",19,null,null,617,null,null,"Gold","Gold",null,null,617,null,null,"Gold","Gold"]
["Hi-Stepper-19.8",19,null,null,618,null,null,"Gold","Gold",null,null,618,null,null,"Gold","Gold"]
["Hi-Stepper-19.9",19,null,null,619,null,null,"Gold","Gold",null,null,619,null,null,"Gold","Gold"]
["Hi-Stepper-20",19,null,null,620,null,null,"Gold","Gold",null,null,620,null,null,"Gold","Gold"]
["Hi-Stepper-20.1",18,null,null,621,null,null,"Gold","Gold",null,null,621,null,null,"Gold","Gold"]
["Hi-Stepper-20.2",18,null,null,622,null,null,"Gold","Gold",null,null,622,null,null,"Gold","Gold"]
["Hi-Stepper-20.3",18,null,null,623,null,null,"Gold","Gold",null,null,623,null,null,"Gold","Gold"]
["Hi-Stepper-20.4",18,null,null,624,null,null,"Gold","Gold",null,null,624,null,null,"Gold","Gold"]
["Hi-Stepper-20.5",18,null,null,625,null,null,"Gold","Gold",null,null,625,null,null,"Gold","Gold"]
["Hi-Stepper-20.6",17,null,null,626,null,null,"Gold","Gold",null,null,626,null,null,"Gold","Gold"]
["Hi-Stepper-20.7",17,null,null,627,null,null,"Gold","Gold",null,null,627,null,null,"Gold","Gold"]
["Hi-Stepper-20.8",17,null,null,628,null,null,"Gold","Gold",null,null,628,null,null,"Gold","Gold"]
["Hi-Stepper-20.9",17,null,null,629,null,null,"Gold","Gold",null,null,629,null,null,"Gold","Gold"]
["Hi-Stepper-21",17,null,null,630,null,null,"Gold","Gold",null,null,630,null,null,"Gold","Gold"]
["Hi-Stepper-21.1",16,null,null,631,null,null,"Gold","Gold",null,null,631,null,null,"Gold","Gold"]
["Hi-Stepper-21.2",16,null,null,632,null,null,"Gold","Gold",null,null,632,null,null,"Gold","Gold"]
["Hi-Stepper-21.3",16,null,null,633,null,null,"Gold","Gold",null,null,633,null,null,"Gold","Gold"]
["Hi-Stepper-21.4",16,null,null,634,null,null,"Gold","Gold",null,null,634,null,null,"Gold","Gold"]
["Hi-Stepper-21.5",16,null,null,635,null,null,"Gold","Gold",null,null,635,null,null,"Gold","Gold"]
["Hi-Stepper-21.6",15,null,null,636,null,null,"Gold","Gold",null,null,636,null,null,"Gold","Gold"]
["Hi-Stepper-21.7",15,null,null,637,null,null,"Gold","Gold",null,null,637,null,null,"Gold","Gold"]
["Hi-Stepper-21.8",15,null,null,638,null,null,"Gold","Gold",null,null,638,null,null,"Gold","Gold"]
["Hi-Stepper-21.9",15,null,null,639,null,null,"Gold","Gold",null,null,639,null,null,"Gold","Gold"]
["Hi-Stepper-22",15,null,null,640,null,null,"Gold","Gold",null,null,640,null,null,"Gold","Gold"]
["Hi-Stepper-22.1",14,null,null,641,null,null,"Gold","Gold",null,null,641,null,null,"Gold","Gold"]
["Hi-Stepper-22.2",14,null,null,642,null,null,"Gold","Gold",null,null,642,null,null,"Gold","Gold"]
["Hi-Stepper-22.3",14,null,null,643,null,null,"Gold","Gold",null,null,643,null,null,"Gold","Gold"]
["Hi-Stepper-22.4",14,null,null,644,null,null,"Gold","Gold",null,null,644,null,null,"Gold","Gold"]
["Hi-Stepper-22.5",14,null,null,645,null,null,"Gold","Gold",null,null,645,null,null,"Gold","Gold"]
["Hi-Stepper-22.6",13,null,null,646,null,null,"Gold","Gold",null,null,646,null,null,"Gold","Gold"]
["Hi-Stepper-22.7",13,null,null,647,null,null,"Gold","Gold",null,null,647,null,null,"Gold","Gold"]
["Hi-Stepper-22.8",13,null,null,648,null,null,"Gold","Gold",null,null,648,null,null,"Gold","Gold"]
["Hi-Stepper-22.9",13,null,null,649,null,null,"Gold","Gold",null,null,649,null,null,"Gold","Gold"]
["Hi-Stepper-23",13,null,null,650,null,null,"Gold","Gold",null,null,650,null,null,"Gold","Gold"]
["Hi-Stepper-23.1",12,null,null,651,null,null,"Gold","Gold",null,null,651,null,null,"Gold","Gold"]
["Hi-Stepper-23.2",12,null,null,652,null,null,"Gold","Gold",null,null,652,null,null,"Gold","Gold"]
["Hi-Stepper-23.3",12,null,null,653,null,null,"Gold","Gold",null,null,653,null,null,"Gold","Gold"]
["Hi-Stepper-23.4",12,null,null,654,null,null,"Gold","Gold",null,null,654,null,null,"Gold","Gold"]
["Hi-Stepper-23.5",12,null,null,655,null,null,"Gold","Gold",null,null,655,null,null,"Gold","Gold"]
["Hi-Stepper-23.6",12,null,null,656,null,null,"Gold","Gold",null,null,656,null,null,"Gold","Gold"]
["Hi-Stepper-23.7",12,null,null,657,null,null,"Gold","Gold",null,null,657,null,null,"Gold","Gold"]
["Hi-Stepper-23.8",12,null,null,658,null,null,"Gold","Gold",null,null,658,null,null,"Gold","Gold"]
["Hi-Stepper-23.9",12,null,null,659,null,null,"Gold","Gold",null,null,659,null,null,"Gold","Gold"]
["Hi-Stepper-24",12,null,null,660,null,null,"Gold","Gold",null,null,660,null,null,"Gold","Gold"]
["Hi-Stepper-24.1",11,null,null,661,null,null,"Gold","Gold",null,null,661,null,null,"Gold","Gold"]
["Hi-Stepper-24.2",11,null,null,662,null,null,"Gold","Gold",null,null,662,null,null,"Gold","Gold"]
["Hi-Stepper-24.3",11,null,null,663,null,null,"Gold","Gold",null,null,663,null,null,"Gold","Gold"]
["Hi-Stepper-24.4",11,null,null,664,null,null,"Gold","Gold",null,null,664,null,null,"Gold","Gold"]
["Hi-Stepper-24.5",11,null,null,665,null,null,"Gold","Gold",null,null,665,null,null,"Gold","Gold"]
["Hi-Stepper-24.6",11,null,null,666,null,null,"Gold","Gold",null,null,666,null,null,"Gold","Gold"]
["Hi-Stepper-24.7",11,null,null,667,null,null,"Gold","Gold",null,null,667,null,null,"Gold","Gold"]
["Hi-Stepper-24.8",11,null,null,668,null,null,"Gold","Gold",null,null,668,null,null,"Gold","Gold"]
["Hi-Stepper-24.9",11,null,null,669,null,null,"Gold","Gold",null,null,669,null,null,"Gold","Gold"]
["Hi-Stepper-25",11,null,null,670,null,null,"Gold","Gold",null,null,670,null,null,"Gold","Gold"]
["Hi-Stepper-25.1",10,null,null,671,null,null,"Gold","Gold",null,null,671,null,null,"Gold","Gold"]
["Hi-Stepper-25.2",10,null,null,672,null,null,"Gold","Gold",null,null,672,null,null,"Gold","Gold"]
["Hi-Stepper-25.3",10,null,null,673,null,null,"Gold","Gold",null,null,673,null,null,"Gold","Gold"]
["Hi-Stepper-25.4",10,null,null,674,null,null,"Gold","Gold",null,null,674,null,null,"Gold","Gold"]
["Hi-Stepper-25.5",10,null,null,675,null,null,"Gold","Gold",null,null,675,null,null,"Gold","Gold"]
["Hi-Stepper-25.6",10,null,null,676,null,null,"Gold","Gold",null,null,676,null,null,"Gold","Gold"]
["Hi-Stepper-25.7",10,null,null,677,null,null,"Gold","Gold",null,null,677,null,null,"Gold","Gold"]
["Hi-Stepper-25.8",10,null,null,678,null,null,"Gold","Gold",null,null,678,null,null,"Gold","Gold"]
["Hi-Stepper-25.9",10,null,null,679,null,null,"Gold","Gold",null,null,679,null,null,"Gold","Gold"]
["Hi-Stepper-26",10,null,null,680,null,null,"Gold","Gold",null,null,680,null,null,"Gold","Gold"]
["Hi-Stepper-26.1",9,null,null,681,null,null,"Gold","Gold",null,null,681,null,null,"Gold","Gold"]
["Hi-Stepper-26.2",9,null,null,682,null,null,"Gold","Gold",null,null,682,null,null,"Gold","Gold"]
["Hi-Stepper-26.3",9,null,null,683,null,null,"Gold","Gold",null,null,683,null,null,"Gold","Gold"]
["Hi-Stepper-26.4",9,null,null,684,null,null,"Gold","Gold",null,null,684,null,null,"Gold","Gold"]
["Hi-Stepper-26.5",9,null,null,685,null,null,"Gold","Gold",null,null,685,null,null,"Gold","Gold"]
["Hi-Stepper-26.6",9,null,null,686,null,null,"Gold","Gold",null,null,686,null,null,"Gold","Gold"]
["Hi-Stepper-26.7",9,null,null,687,null,null,"Gold","Gold",null,null,687,null,null,"Gold","Gold"]
["Hi-Stepper-26.8",9,null,null,688,null,null,"Gold","Gold",null,null,688,null,null,"Gold","Gold"]
["Hi-Stepper-26.9",9,null,null,689,null,null,"Gold","Gold",null,null,689,null,null,"Gold","Gold"]
["Hi-Stepper-27",9,null,null,690,null,null,"Gold","Gold",null,null,690,null,null,"Gold","Gold"]
["Hi-Stepper-27.1",8,null,null,691,null,null,"Gold","Gold",null,null,691,null,null,"Gold","Gold"]
["Hi-Stepper-27.2",8,null,null,692,null,null,"Gold","Gold",null,null,692,null,null,"Gold","Gold"]
["Hi-Stepper-27.3",8,null,null,693,null,null,"Gold","Gold",null,null,693,null,null,"Gold","Gold"]
["Hi-Stepper-27.4",8,null,null,694,null,null,"Gold","Gold",null,null,694,null,null,"Gold","Gold"]
["Hi-Stepper-27.5",8,null,null,695,null,null,"Gold","Gold",null,null,695,null,null,"Gold","Gold"]
["Hi-Stepper-27.6",8,null,null,696,null,null,"Gold","Gold",null,null,696,null,null,"Gold","Gold"]
["Hi-Stepper-27.7",8,null,null,697,null,null,"Gold","Gold",null,null,697,null,null,"Gold","Gold"]
["Hi-Stepper-27.8",8,null,null,698,null,null,"Gold","Gold",null,null,698,null,null,"Gold","Gold"]
["Hi-Stepper-27.9",8,null,null,699,null,null,"Gold","Gold",null,null,699,null,null,"Gold","Gold"]
["Hi-Stepper-28",8,null,null,700,null,null,"Gold","Gold",null,null,700,null,null,"Gold","Gold"]
["Hi-Stepper-28.1",7,null,null,701,null,null,"Gold","Gold",null,null,701,null,null,"Gold","Gold"]
["Hi-Stepper-28.2",7,null,null,702,null,null,"Gold","Gold",null,null,702,null,null,"Gold","Gold"]
["Hi-Stepper-28.3",7,null,null,703,null,null,"Gold","Gold",null,null,703,null,null,"Gold","Gold"]
["Hi-Stepper-28.4",7,null,null,704,null,null,"Gold","Gold",null,null,704,null,null,"Gold","Gold"]
["Hi-Stepper-28.5",7,null,null,705,null,null,"Gold","Gold",null,null,705,null,null,"Gold","Gold"]
["Hi-Stepper-28.6",7,null,null,706,null,null,"Gold","Gold",null,null,706,null,null,"Gold","Gold"]
["Hi-Stepper-28.7",7,null,null,707,null,null,"Gold","Gold",null,null,707,null,null,"Gold","Gold"]
["Hi-Stepper-28.8",7,null,null,708,null,null,"Gold","Gold",null,null,708,null,null,"Gold","Gold"]
["Hi-Stepper-28.9",7,null,null,709,null,null,"Gold","Gold",null,null,709,null,null,"Gold","Gold"]
["Hi-Stepper-29",7,null,null,710,null,null,"Gold","Gold",null,null,710,null,null,"Gold","Gold"]
["Hi-Stepper-29.1",6,null,null,711,null,null,"Gold","Gold",null,null,711,null,null,"Gold","Gold"]
["Hi-Stepper-29.2",6,null,null,712,null,null,"Gold","Gold",null,null,712,null,null,"Gold","Gold"]
["Hi-Stepper-29.3",6,null,null,713,null,null,"Gold","Gold",null,null,713,null,null,"Gold","Gold"]
["Hi-Stepper-29.4",6,null,null,714,null,null,"Gold","Gold",null,null,714,null,null,"Gold","Gold"]
["Hi-Stepper-29.5",6,null,null,715,null,null,"Gold","Gold",null,null,715,null,null,"Gold","Gold"]
["Hi-Stepper-29.6",6,null,null,716,null,null,"Gold","Gold",null,null,716,null,null,"Gold","Gold"]
["Hi-Stepper-29.7",6,null,null,717,null,null,"Gold","Gold",null,null,717,null,null,"Gold","Gold"]
["Hi-Stepper-29.8",6,null,null,718,null,null,"Gold","Gold",null,null,718,null,null,"Gold","Gold"]
["Hi-Stepper-29.9",6,null,null,719,null,null,"Gold","Gold",null,null,719,null,null,"Gold","Gold"]
["Hi-Stepper-30",6,null,null,720,null,null,"Gold","Gold",null,null,720,null,null,"Gold","Gold"]
["Hi-Stepper-30.1",5,null,null,721,null,null,"Gold","Gold",null,null,721,null,null,"Gold","Gold"]
["Hi-Stepper-30.2",5,null,null,722,null,null,"Gold","Gold",null,null,722,null,null,"Gold","Gold"]
["Hi-Stepper-30.3",5,null,null,723,null,null,"Gold","Gold",null,null,723,null,null,"Gold","Gold"]
["Hi-Stepper-30.4",5,null,null,724,null,null,"Gold","Gold",null,null,724,null,null,"Gold","Gold"]
["Hi-Stepper-30.5",5,null,null,725,null,null,"Gold","Gold",null,null,725,null,null,"Gold","Gold"]
["Hi-Stepper-30.6",5,null,null,726,null,null,"Gold","Gold",null,null,726,null,null,"Gold","Gold"]
["Hi-Stepper-30.7",5,null,null,727,null,null,"Gold","Gold",null,null,727,null,null,"Gold","Gold"]
["Hi-Stepper-30.8",5,null,null,728,null,null,"Gold","Gold",null,null,728,null,null,"Gold","Gold"]
["Hi-Stepper-30.9",5,null,null,729,null,null,"Gold","Gold",null,null,729,null,null,"Gold","Gold"]
["Hi-Stepper-31",5,null,null,730,null,null,"Gold","Gold",null,null,730,null,null,"Gold","Gold"]
["Hi-Stepper-31.1",5,null,null,731,null,null,"Gold","Gold",null,null,731,null,null,"Gold","Gold"]
["Hi-Stepper-31.2",5,null,null,732,null,null,"Gold","Gold",null,null,732,null,null,"Gold","Gold"]
["Hi-Stepper-31.3",5,null,null,733,null,null,"Gold","Gold",null,null,733,null,null,"Gold","Gold"]
["Hi-Stepper-31.4",5,null,null,734,null,null,"Gold","Gold",null,null,734,null,null,"Gold","Gold"]
["Hi-Stepper-31.5",5,null,null,735,null,null,"Gold","Gold",null,null,735,null,null,"Gold","Gold"]
["Hi-Stepper-31.6",5,null,null,736,null,null,"Gold","Gold",null,null,736,null,null,"Gold","Gold"]
["Hi-Stepper-31.7",5,null,null,737,null,null,"Gold","Gold",null,null,737,null,null,"Gold","Gold"]
["Hi-Stepper-31.8",5,null,null,738,null,null,"Gold","Gold",null,null,738,null,null,"Gold","Gold"]
["Hi-Stepper-31.9",5,null,null,739,null,null,"Gold","Gold",null,null,739,null,null,"Gold","Gold"]
["Hi-Stepper-32",5,null,null,740,null,null,"Gold","Gold",null,null,740,null,null,"Gold","Gold"]
["Hi-Stepper-32.1",4,null,null,741,null,null,"Gold","Gold",null,null,741,null,null,"Gold","Gold"]
["Hi-Stepper-32.2",4,null,null,742,null,null,"Gold","Gold",null,null,742,null,null,"Gold","Gold"]
["Hi-Stepper-32.3",4,null,null,743,null,null,"Gold","Gold",null,null,743,null,null,"Gold","Gold"]
["Hi-Stepper-32.4",4,null,null,744,null,null,"Gold","Gold",null,null,744,null,null,"Gold","Gold"]
["Hi-Stepper-32.5",4,null,null,745,null,null,"Gold","Gold",null,null,745,null,null,"Gold","Gold"]
["Hi-Stepper-32.6",4,null,null,746,null,null,"Gold","Gold",null,null,746,null,null,"Gold","Gold"]
["Hi-Stepper-32.7",4,null,null,747,null,null,"Gold","Gold",null,null,747,null,null,"Gold","Gold"]
["Hi-Stepper-32.8",4,null,null,748,null,null,"Gold","Gold",null,null,748,null,null,"Gold","Gold"]
["Hi-Stepper-32.9",4,null,null,749,null,null,"Gold","Gold",null,null,749,null,null,"Gold","Gold"]
["Hi-Stepper-33",4,null,null,750,null,null,"Gold","Gold",null,null,750,null,null,"Gold","Gold"]
["Hi-Stepper-33.1",4,null,null,751,null,null,"Gold","Gold",null,null,751,null,null,"Gold","Gold"]
["Hi-Stepper-33.2",4,null,null,752,null,null,"Gold","Gold",null,null,752,null,null,"Gold","Gold"]
["Hi-Stepper-33.3",4,null,null,753,null,null,"Gold","Gold",null,null,753,null,null,"Gold","Gold"]
["Hi-Stepper-33.4",4,null,null,754,null,null,"Gold","Gold",null,null,754,null,null,"Gold","Gold"]
["Hi-Stepper-33.5",4,null,null,755,null,null,"Gold","Gold",null,null,755,null,null,"Gold","Gold"]
["Hi-Stepper-33.6",4,null,null,756,null,null,"Gold","Gold",null,null,756,null,null,"Gold","Gold"]
["Hi-Stepper-33.7",4,null,null,757,null,null,"Gold","Gold",null,null,757,null,null,"Gold","Gold"]
["Hi-Stepper-33.8",4,null,null,758,null,null,"Gold","Gold",null,null,758,null,null,"Gold","Gold"]
["Hi-Stepper-33.9",4,null,null,759,null,null,"Gold","Gold",null,null,759,null,null,"Gold","Gold"]
["Hi-Stepper-34",4,null,null,760,null,null,"Gold","Gold",null,null,760,null,null,"Gold","Gold"]
["Hi-Stepper-34.1",3,null,null,761,null,null,"Gold","Gold",null,null,761,null,null,"Gold","Gold"]
["Hi-Stepper-34.2",3,null,null,762,null,null,"Gold","Gold",null,null,762,null,null,"Gold","Gold"]
["Hi-Stepper-34.3",3,null,null,763,null,null,"Gold","Gold",null,null,763,null,null,"Gold","Gold"]
["Hi-Stepper-34.4",3,null,null,764,null,null,"Gold","Gold",null,null,764,null,null,"Gold","Gold"]
["Hi-Stepper-34.5",3,null,null,765,null,null,"Gold","Gold",null,null,765,null,null,"Gold","Gold"]
["Hi-Stepper-34.6",3,null,null,766,null,null,"Gold","Gold",null,null,766,null,null,"Gold","Gold"]
["Hi-Stepper-34.7",3,null,null,767,null,null,"Gold","Gold",null,null,767,null,null,"Gold","Gold"]
["Hi-Stepper-34.8",3,null,null,768,null,null,"Gold","Gold",null,null,768,null,null,"Gold","Gold"]
["Hi-Stepper-34.9",3,null,null,769,null,null,"Gold","Gold",null,null,769,null,null,"Gold","Gold"]
["Hi-Stepper-35",3,null,null,770,null,null,"Gold","Gold",null,null,770,null,null,"Gold","Gold"]
["Hi-Stepper-35.1",3,null,null,771,null,null,"Gold","Gold",null,null,771,null,null,"Gold","Gold"]
["Hi-Stepper-35.2",3,null,null,772,null,null,"Gold","Gold",null,null,772,null,null,"Gold","Gold"]
["Hi-Stepper-35.3",3,null,null,773,null,null,"Gold","Gold",null,null,773,null,null,"Gold","Gold"]
["Hi-Stepper-35.4",3,null,null,774,null,null,"Gold","Gold",null,null,774,null,null,"Gold","Gold"]
["Hi-Stepper-35.5",3,null,null,775,null,null,"Gold","Gold",null,null,775,null,null,"Gold","Gold"]
["Hi-Stepper-35.6",3,null,null,776,null,null,"Gold","Gold",null,null,776,null,null,"Gold","Gold"]
["Hi-Stepper-35.7",3,null,null,777,null,null,"Gold","Gold",null,null,777,null,null,"Gold","Gold"]
["Hi-Stepper-35.8",3,null,null,778,null,null,"Gold","Gold",null,null,778,null,null,"Gold","Gold"]
["Hi-Stepper-35.9",3,null,null,779,null,null,"Gold","Gold",null,null,779,null,null,"Gold","Gold"]
["Hi-Stepper-36",3,null,null,780,null,null,"Gold","Gold",null,null,780,null,null,"Gold","Gold"]
["Hi-Stepper-36.1",2,null,null,781,null,null,"Gold","Gold",null,null,781,null,null,"Gold","Gold"]
["Hi-Stepper-36.2",2,null,null,782,null,null,"Gold","Gold",null,null,782,null,null,"Gold","Gold"]
["Hi-Stepper-36.3",2,null,null,783,null,null,"Gold","Gold",null,null,783,null,null,"Gold","Gold"]
["Hi-Stepper-36.4",2,null,null,784,null,null,"Gold","Gold",null,null,784,null,null,"Gold","Gold"]
["Hi-Stepper-36.5",2,null,null,785,null,null,"Gold","Gold",null,null,785,null,null,"Gold","Gold"]
["Hi-Stepper-36.6",2,null,null,786,null,null,"Gold","Gold",null,null,786,null,null,"Gold","Gold"]
["Hi-Stepper-36.7",2,null,null,787,null,null,"Gold","Gold",null,null,787,null,null,"Gold","Gold"]
["Hi-Stepper-36.8",2,null,null,788,null,null,"Gold","Gold",null,null,788,null,null,"Gold","Gold"]
["Hi-Stepper-36.9",2,null,null,789,null,null,"Gold","Gold",null,null,789,null,null,"Gold","Gold"]
["Hi-Stepper-37",2,null,null,790,null,null,"Gold","Gold",null,null,790,null,null,"Gold","Gold"]
["Hi-Stepper-37.1",2,null,null,791,null,null,"Gold","Gold",null,null,791,null,null,"Gold","Gold"]
["Hi-Stepper-37.2",2,null,null,792,null,null,"Gold","Gold",null,null,792,null,null,"Gold","Gold"]
["Hi-Stepper-37.3",2,null,null,793,null,null,"Gold","Gold",null,null,793,null,null,"Gold","Gold"]
["Hi-Stepper-37.4",2,null,null,794,null,null,"Gold","Gold",null,null,794,null,null,"Gold","Gold"]
["Hi-Stepper-37.5",2,null,null,795,null,null,"Gold","Gold",null,null,795,null,null,"Gold","Gold"]
["Hi-Stepper-37.6",2,null,null,796,null,null,"Gold","Gold",null,null,796,null,null,"Gold","Gold"]
["Hi-Stepper-37.7",2,null,null,797,null,null,"Gold","Gold",null,null,797,null,null,"Gold","Gold"]
["Hi-Stepper-37.8",2,null,null,798,null,null,"Gold","Gold",null,null,798,null,null,"Gold","Gold"]
["Hi-Stepper-37.9",2,null,null,799,null,null,"Gold","Gold",null,null,799,null,null,"Gold","Gold"]
["Hi-Stepper-38",2,null,null,800,null,null,"Gold","Gold",null,null,800,null,null,"Gold","Gold"]
["Hi-Stepper-38.1",1]
["Hi-Stepper-38.2",1]
["Hi-Stepper-38.3",1]
["Hi-Stepper-38.4",1]
["Hi-Stepper-38.5",1]
["Hi-Stepper-38.6",1]
["Hi-Stepper-38.7",1]
["Hi-Stepper-38.8",1]
["Hi-Stepper-38.9",1]
["Hi-Stepper-39",1]
["Hi-Stepper-39.1",1]
["Hi-Stepper-39.2",1]
["Hi-Stepper-39.3",1]
["Hi-Stepper-39.4",1]
["Hi-Stepper-39.5",1]
["Hi-Stepper-39.6",1]
["Hi-Stepper-39.7",1]
["Hi-Stepper-39.8",1]
["Hi-Stepper-39.9",1]
["Hi-Stepper-40",1]
["Hi-Stepper-40.1",1]
["Hi-Stepper-40.2",1]
["Hi-Stepper-40.3",1]
["Hi-Stepper-40.4",1]
["Hi-Stepper-40.5",1]
["Hi-Stepper-40.6",1]
["Hi-Stepper-40.7",1]
["Hi-Stepper-40.8",1]
["Hi-Stepper-40.9",1]
["Hi-Stepper-41",1]
["Hi-Stepper-41.1",1]
["Hi-Stepper-41.2",1]
["Hi-Stepper-41.3",1]
["Hi-Stepper-41.4",1]
["Hi-Stepper-41.5",1]
["Hi-Stepper-41.6",1]
["Hi-Stepper-41.7",1]
["Hi-Stepper-41.8",1]
["Hi-Stepper-41.9",1]
["Hi-Stepper-42",1]
["Hi-Stepper-42.1",1]
["Hi-Stepper-42.2",1]
["Hi-Stepper-42.3",1]
["Hi-Stepper-42.4",1]
["Hi-Stepper-42.5",1]
["Hi-Stepper-42.6",1]
["Hi-Stepper-42.7",1]
["Hi-Stepper-42.8",1]
["Hi-Stepper-42.9",1]
["Hi-Stepper-43",1]
["Hi-Stepper-43.1",1]
["Hi-Stepper-43.2",1]
["Hi-Stepper-43.3",1]
["Hi-Stepper-43.4",1]
["Hi-Stepper-43.5",1]
["Hi-Stepper-43.6",1]
["Hi-Stepper-43.7",1]
["Hi-Stepper-43.8",1]
["Hi-Stepper-43.9",1]
["Hi-Stepper-44",1]
["Hi-Stepper-44.1",1]
["Hi-Stepper-44.2",1]
["Hi-Stepper-44.3",1]
["Hi-Stepper-44.4",1]
["Hi-Stepper-44.5",1]
["Hi-Stepper-44.6",1]
["Hi-Stepper-44.7",1]
["Hi-Stepper-44.8",1]
["Hi-Stepper-44.9",1]
["Hi-Stepper-45",1]
["Hi-Stepper-45.1",1]
["Hi-Stepper-45.2",1]
["Hi-Stepper-45.3",1]
["Hi-Stepper-45.4",1]
["Hi-Stepper-45.5",1]
["Hi-Stepper-45.6",1]
["Hi-Stepper-45.7",1]
["Hi-Stepper-45.8",1]
["Hi-Stepper-45.9",1]
["Hi-Stepper-46",1]
["Hi-Stepper-46.1",1]
["Hi-Stepper-46.2",1]
["Hi-Stepper-46.3",1]
["Hi-Stepper-46.4",1]
["Hi-Stepper-46.5",1]
["Hi-Stepper-46.6",1]
["Hi-Stepper-46.7",1]
["Hi-Stepper-46.8",1]
["Hi-Stepper-46.9",1]
["Hi-Stepper-47",1]
["Hi-Stepper-47.1",1]
["Hi-Stepper-47.2",1]
["Hi-Stepper-47.3",1]
["Hi-Stepper-47.4",1]
["Hi-Stepper-47.5",1]
["Hi-Stepper-47.6",1]
["Hi-Stepper-47.7",1]
["Hi-Stepper-47.8",1]
["Hi-Stepper-47.9",1]
["Hi-Stepper-48",1]
["Hi-Stepper-48.1",1]
["Hi-Stepper-48.2",1]
["Hi-Stepper-48.3",1]
["Hi-Stepper-48.4",1]
["Hi-Stepper-48.5",1]
["Hi-Stepper-48.6",1]
["Hi-Stepper-48.7",1]
["Hi-Stepper-48.8",1]
["Hi-Stepper-48.9",1]
["Hi-Stepper-49",1]
["Hi-Stepper-49.1",1]
["Hi-Stepper-49.2",1]
["Hi-Stepper-49.3",1]
["Hi-Stepper-49.4",1]
["Hi-Stepper-49.5",1]
["Hi-Stepper-49.6",1]
["Hi-Stepper-49.7",1]
["Hi-Stepper-49.8",1]
["Hi-Stepper-49.9",1]
["Hi-Stepper-50",1]
["Chest Push-14",98]
["Chest Push-13.75",96]
["Chest Push-13.5",94]
["Chest Push-13.25",92]
["Chest Push-13",90]
["Chest Push-12.75",88]
["Chest Push-12.5",86]
["Chest Push-12.25",84]
["Chest Push-12",82]
["Chest Push-11.75",80]
["Chest Push-11.5",78]
["Chest Push-11.25",76]
["Chest Push-11",74]
["Chest Push-10.75",72]
["Chest Push-10.5",70]
["Chest Push-10.25",68]
["Chest Push-10",66]
["Chest Push-9.75",65]
["Chest Push-9.5",64]
["Chest Push-9.25",62]
["Chest Push-9",60]
["Chest Push-8.75",58]
["Chest Push-8.5",57]
["Chest Push-8.25",56]
["Chest Push-8",55]
["Chest Push-7.75",53]
["Chest Push-7.5",52]
["Chest Push-7.25",50]
["Chest Push-7",49]
["Chest Push-6.75",47]
["Chest Push-6.5",46]
["Chest Push-6.25",44]
["Chest Push-6",42]
["Chest Push-5.75",40]
["Chest Push-5.5",38]
["Chest Push-5.25",36]
["Chest Push-5",33]
["Chest Push-4.75",31]
["Chest Push-4.5",28]
["Chest Push-4.25",25]
["Chest Push-4",22]
["Chest Push-3.75",19]
["Chest Push-3.5",16]
["Chest Push-3.25",13]
["Chest Push-3",10]
["Chest Push-2.75",8]
["Chest Push-2.5",6]
["Chest Push-2.25",4]
["Chest Push-2",4]
["Chest Push-1.75",1]
["Chest Push-1.5",1]
["Chest Push-1.25",1]
["Chest Push-1",1]
["Chest Push-0.75",1]
["Chest Push-0.5",1]
["Chest Push-0.25",1]
["Vertical Jump-80",92]
["Vertical Jump-79",91]
["Vertical Jump-78",90]
["Vertical Jump-77",89]
["Vertical Jump-76",88]
["Vertical Jump-75",87]
["Vertical Jump-74",86]
["Vertical Jump-73",85]
["Vertical Jump-72",84]
["Vertical Jump-71",83]
["Vertical Jump-70",82]
["Vertical Jump-69",81]
["Vertical Jump-68",80]
["Vertical Jump-67",79]
["Vertical Jump-66",78]
["Vertical Jump-65",77]
["Vertical Jump-64",76]
["Vertical Jump-63",75]
["Vertical Jump-62",74]
["Vertical Jump-61",73]
["Vertical Jump-60",71]
["Vertical Jump-59",70]
["Vertical Jump-58",68]
["Vertical Jump-57",67]
["Vertical Jump-56",65]
["Vertical Jump-55",64]
["Vertical Jump-54",62]
["Vertical Jump-53",61]
["Vertical Jump-52",59]
["Vertical Jump-51",58]
["Vertical Jump-50",56]
["Vertical Jump-49",55]
["Vertical Jump-48",54]
["Vertical Jump-47",53]
["Vertical Jump-46",52]
["Vertical Jump-45",51]
["Vertical Jump-44",50]
["Vertical Jump-43",49]
["Vertical Jump-42",48]
["Vertical Jump-41",47]
["Vertical Jump-40",46]
["Vertical Jump-39",44]
["Vertical Jump-38",43]
["Vertical Jump-37",41]
["Vertical Jump-36",40]
["Vertical Jump-35",38]
["Vertical Jump-34",37]
["Vertical Jump-33",35]
["Vertical Jump-32",34]
["Vertical Jump-31",32]
["Vertical Jump-30",31]
["Vertical Jump-29",30]
["Vertical Jump-28",28]
["Vertical Jump-27",27]
["Vertical Jump-26",26]
["Vertical Jump-25",24]
["Vertical Jump-24",23]
["Vertical Jump-23",22]
["Vertical Jump-22",20]
["Vertical Jump-21",18]
["Vertical Jump-20",16]
["Vertical Jump-19",15]
["Vertical Jump-18",14]
["Vertical Jump-17",13]
["Vertical Jump-16",12]
["Vertical Jump-15",11]
["Vertical Jump-14",10]
["Vertical Jump-13",9]
["Vertical Jump-12",8]
["Vertical Jump-11",7]
["Vertical Jump-10",6]
["Vertical Jump-9",5]
["Vertical Jump-8",4]
["Vertical Jump-7",3]
["Vertical Jump-6",2]
["Vertical Jump-5",1]
["Vertical Jump-4",1]
["Vertical Jump-3",1]
["Vertical Jump-2",1]
["Vertical Jump-1",1]
["Shuttle Run-20.1",119]
["Shuttle Run-20.2",118]
["Shuttle Run-20.3",117]
["Shuttle Run-20.4",116]
["Shuttle Run-20.5",115]
["Shuttle Run-20.6",114]
["Shuttle Run-20.7",113]
["Shuttle Run-20.8",112]
["Shuttle Run-20.9",111]
["Shuttle Run-21",110]
["Shuttle Run-21.1",109]
["Shuttle Run-21.2",108]
["Shuttle Run-21.3",107]
["Shuttle Run-21.4",106]
["Shuttle Run-21.5",105]
["Shuttle Run-21.6",104]
["Shuttle Run-21.7",103]
["Shuttle Run-21.8",102]
["Shuttle Run-21.9",101]
["Shuttle Run-22",100]
["Shuttle Run-22.1",99]
["Shuttle Run-22.2",98]
["Shuttle Run-22.3",97]
["Shuttle Run-22.4",96]
["Shuttle Run-22.5",95]
["Shuttle Run-22.6",94]
["Shuttle Run-22.7",93]
["Shuttle Run-22.8",92]
["Shuttle Run-22.9",91]
["Shuttle Run-23",90]
["Shuttle Run-23.1",89]
["Shuttle Run-23.2",88]
["Shuttle Run-23.3",87]
["Shuttle Run-23.4",86]
["Shuttle Run-23.5",85]
["Shuttle Run-23.6",84]
["Shuttle Run-23.7",83]
["Shuttle Run-23.8",82]
["Shuttle Run-23.9",81]
["Shuttle Run-24",80]
["Shuttle Run-24.1",79]
["Shuttle Run-24.2",79]
["Shuttle Run-24.3",78]
["Shuttle Run-24.4",78]
["Shuttle Run-24.5",77]
["Shuttle Run-24.6",77]
["Shuttle Run-24.7",76]
["Shuttle Run-24.8",76]
["Shuttle Run-24.9",75]
["Shuttle Run-25",75]
["Shuttle Run-25.1",74]
["Shuttle Run-25.2",74]
["Shuttle Run-25.3",73]
["Shuttle Run-25.4",73]
["Shuttle Run-25.5",72]
["Shuttle Run-25.6",72]
["Shuttle Run-25.7",71]
["Shuttle Run-25.8",71]
["Shuttle Run-25.9",70]
["Shuttle Run-26",70]
["Shuttle Run-26.1",69]
["Shuttle Run-26.2",69]
["Shuttle Run-26.3",68]
["Shuttle Run-26.4",68]
["Shuttle Run-26.5",67]
["Shuttle Run-26.6",67]
["Shuttle Run-26.7",66]
["Shuttle Run-26.8",66]
["Shuttle Run-26.9",65]
["Shuttle Run-27",65]
["Shuttle Run-27.1",64]
["Shuttle Run-27.2",64]
["Shuttle Run-27.3",63]
["Shuttle Run-27.4",63]
["Shuttle Run-27.5",62]
["Shuttle Run-27.6",62]
["Shuttle Run-27.7",61]
["Shuttle Run-27.8",61]
["Shuttle Run-27.9",60]
["Shuttle Run-28",60]
["Shuttle Run-28.1",59]
["Shuttle Run-28.2",59]
["Shuttle Run-28.3",58]
["Shuttle Run-28.4",58]
["Shuttle Run-28.5",57]
["Shuttle Run-28.6",57]
["Shuttle Run-28.7",56]
["Shuttle Run-28.8",56]
["Shuttle Run-28.9",55]
["Shuttle Run-29",55]
["Shuttle Run-29.1",54]
["Shuttle Run-29.2",54]
["Shuttle Run-29.3",53]
["Shuttle Run-29.4",53]
["Shuttle Run-29.5",52]
["Shuttle Run-29.6",52]
["Shuttle Run-29.7",51]
["Shuttle Run-29.8",51]
["Shuttle Run-29.9",50]
["Shuttle Run-30",50]
["Shuttle Run-30.1",49]
["Shuttle Run-30.2",49]
["Shuttle Run-30.3",48]
["Shuttle Run-30.4",48]
["Shuttle Run-30.5",47]
["Shuttle Run-30.6",47]
["Shuttle Run-30.7",46]
["Shuttle Run-30.8",46]
["Shuttle Run-30.9",45]
["Shuttle Run-31",45]
["Shuttle Run-31.1",44]
["Shuttle Run-31.2",44]
["Shuttle Run-31.3",43]
["Shuttle Run-31.4",43]
["Shuttle Run-31.5",42]
["Shuttle Run-31.6",42]
["Shuttle Run-31.7",41]
["Shuttle Run-31.8",41]
["Shuttle Run-31.9",40]
["Shuttle Run-32",40]
["Shuttle Run-32.1",39]
["Shuttle Run-32.2",39]
["Shuttle Run-32.3",38]
["Shuttle Run-32.4",38]
["Shuttle Run-32.5",37]
["Shuttle Run-32.6",37]
["Shuttle Run-32.7",36]
["Shuttle Run-32.8",36]
["Shuttle Run-32.9",35]
["Shuttle Run-33",35]
["Shuttle Run-33.1",34]
["Shuttle Run-33.2",34]
["Shuttle Run-33.3",33]
["Shuttle Run-33.4",33]
["Shuttle Run-33.5",32]
["Shuttle Run-33.6",32]
["Shuttle Run-33.7",31]
["Shuttle Run-33.8",31]
["Shuttle Run-33.9",30]
["Shuttle Run-34",30]
["Shuttle Run-34.1",29]
["Shuttle Run-34.2",29]
["Shuttle Run-34.3",28]
["Shuttle Run-34.4",28]
["Shuttle Run-34.5",27]
["Shuttle Run-34.6",27]
["Shuttle Run-34.7",26]
["Shuttle Run-34.8",26]
["Shuttle Run-34.9",25]
["Shuttle Run-35",25]
["Shuttle Run-35.1",24]
["Shuttle Run-35.2",24]
["Shuttle Run-35.3",24]
["Shuttle Run-35.4",24]
["Shuttle Run-35.5",24]
["Shuttle Run-35.6",23]
["Shuttle Run-35.7",23]
["Shuttle Run-35.8",23]
["Shuttle Run-35.9",23]
["Shuttle Run-36",23]
["Shuttle Run-36.1",22]
["Shuttle Run-36.2",22]
["Shuttle Run-36.3",22]
["Shuttle Run-36.4",22]
["Shuttle Run-36.5",22]
["Shuttle Run-36.6",21]
["Shuttle Run-36.7",21]
["Shuttle Run-36.8",21]
["Shuttle Run-36.9",21]
["Shuttle Run-37",21]
["Shuttle Run-37.1",20]
["Shuttle Run-37.2",20]
["Shuttle Run-37.3",20]
["Shuttle Run-37.4",20]
["Shuttle Run-37.5",20]
["Shuttle Run-37.6",19]
["Shuttle Run-37.7",19]
["Shuttle Run-37.8",19]
["Shuttle Run-37.9",19]
["Shuttle Run-38",19]
["Shuttle Run-38.1",18]
["Shuttle Run-38.2",18]
["Shuttle Run-38.3",18]
["Shuttle Run-38.4",18]
["Shuttle Run-38.5",18]
["Shuttle Run-38.6",17]
["Shuttle Run-38.7",17]
["Shuttle Run-38.8",17]
["Shuttle Run-38.9",17]
["Shuttle Run-39",17]
["Shuttle Run-39.1",16]
["Shuttle Run-39.2",16]
["Shuttle Run-39.3",16]
["Shuttle Run-39.4",16]
["Shuttle Run-39.5",16]
["Shuttle Run-39.6",15]
["Shuttle Run-39.7",15]
["Shuttle Run-39.8",15]
["Shuttle Run-39.9",15]
["Shuttle Run-40",15]
["Shuttle Run-40.1",14]
["Shuttle Run-40.2",14]
["Shuttle Run-40.3",14]
["Shuttle Run-40.4",14]
["Shuttle Run-40.5",14]
["Shuttle Run-40.6",13]
["Shuttle Run-40.7",13]
["Shuttle Run-40.8",13]
["Shuttle Run-40.9",13]
["Shuttle Run-41",13]
["Shuttle Run-41.1",12]
["Shuttle Run-41.2",12]
["Shuttle Run-41.3",12]
["Shuttle Run-41.4",12]
["Shuttle Run-41.5",12]
["Shuttle Run-41.6",12]
["Shuttle Run-41.7",12]
["Shuttle Run-41.8",12]
["Shuttle Run-41.9",12]
["Shuttle Run-42",12]
["Shuttle Run-42.1",11]
["Shuttle Run-42.2",11]
["Shuttle Run-42.3",11]
["Shuttle Run-42.4",11]
["Shuttle Run-42.5",11]
["Shuttle Run-42.6",11]
["Shuttle Run-42.7",11]
["Shuttle Run-42.8",11]
["Shuttle Run-42.9",11]
["Shuttle Run-43",11]
["Shuttle Run-43.1",10]
["Shuttle Run-43.2",10]
["Shuttle Run-43.3",10]
["Shuttle Run-43.4",10]
["Shuttle Run-43.5",10]
["Shuttle Run-43.6",10]
["Shuttle Run-43.7",10]
["Shuttle Run-43.8",10]
["Shuttle Run-43.9",10]
["Shuttle Run-44",10]
["Shuttle Run-44.1",9]
["Shuttle Run-44.2",9]
["Shuttle Run-44.3",9]
["Shuttle Run-44.4",9]
["Shuttle Run-44.5",9]
["Shuttle Run-44.6",9]
["Shuttle Run-44.7",9]
["Shuttle Run-44.8",9]
["Shuttle Run-44.9",9]
["Shuttle Run-45",9]
["Shuttle Run-45.1",8]
["Shuttle Run-45.2",8]
["Shuttle Run-45.3",8]
["Shuttle Run-45.4",8]
["Shuttle Run-45.5",8]
["Shuttle Run-45.6",8]
["Shuttle Run-45.7",8]
["Shuttle Run-45.8",8]
["Shuttle Run-45.9",8]
["Shuttle Run-46",8]
["Shuttle Run-46.1",7]
["Shuttle Run-46.2",7]
["Shuttle Run-46.3",7]
["Shuttle Run-46.4",7]
["Shuttle Run-46.5",7]
["Shuttle Run-46.6",7]
["Shuttle Run-46.7",7]
["Shuttle Run-46.8",7]
["Shuttle Run-46.9",7]
["Shuttle Run-47",7]
["Shuttle Run-47.1",7]
["Shuttle Run-47.2",7]
["Shuttle Run-47.3",7]
["Shuttle Run-47.4",7]
["Shuttle Run-47.5",7]
["Shuttle Run-47.6",7]
["Shuttle Run-47.7",7]
["Shuttle Run-47.8",7]
["Shuttle Run-47.9",7]
["Shuttle Run-48",7]
["Shuttle Run-48.1",6]
["Shuttle Run-48.2",6]
["Shuttle Run-48.3",6]
["Shuttle Run-48.4",6]
["Shuttle Run-48.5",6]
["Shuttle Run-48.6",6]
["Shuttle Run-48.7",6]
["Shuttle Run-48.8",6]
["Shuttle Run-48.9",6]
["Shuttle Run-49",6]
["Shuttle Run-49.1",6]
["Shuttle Run-49.2",6]
["Shuttle Run-49.3",6]
["Shuttle Run-49.4",6]
["Shuttle Run-49.5",6]
["Shuttle Run-49.6",6]
["Shuttle Run-49.7",6]
["Shuttle Run-49.8",6]
["Shuttle Run-49.9",6]
["Shuttle Run-50",6]
["Shuttle Run-50.1",5]
["Shuttle Run-50.2",5]
["Shuttle Run-50.3",5]
["Shuttle Run-50.4",5]
["Shuttle Run-50.5",5]
["Shuttle Run-50.6",5]
["Shuttle Run-50.7",5]
["Shuttle Run-50.8",5]
["Shuttle Run-50.9",5]
["Shuttle Run-51",5]
["Shuttle Run-51.1",5]
["Shuttle Run-51.2",5]
["Shuttle Run-51.3",5]
["Shuttle Run-51.4",5]
["Shuttle Run-51.5",5]
["Shuttle Run-51.6",5]
["Shuttle Run-51.7",5]
["Shuttle Run-51.8",5]
["Shuttle Run-51.9",5]
["Shuttle Run-52",5]
["Shuttle Run-52.1",4]
["Shuttle Run-52.2",4]
["Shuttle Run-52.3",4]
["Shuttle Run-52.4",4]
["Shuttle Run-52.5",4]
["Shuttle Run-52.6",4]
["Shuttle Run-52.7",4]
["Shuttle Run-52.8",4]
["Shuttle Run-52.9",4]
["Shuttle Run-53",4]
["Shuttle Run-53.1",4]
["Shuttle Run-53.2",4]
["Shuttle Run-53.3",4]
["Shuttle Run-53.4",4]
["Shuttle Run-53.5",4]
["Shuttle Run-53.6",4]
["Shuttle Run-53.7",4]
["Shuttle Run-53.8",4]
["Shuttle Run-53.9",4]
["Shuttle Run-54",4]
["Shuttle Run-54.1",3]
["Shuttle Run-54.2",3]
["Shuttle Run-54.3",3]
["Shuttle Run-54.4",3]
["Shuttle Run-54.5",3]
["Shuttle Run-54.6",3]
["Shuttle Run-54.7",3]
["Shuttle Run-54.8",3]
["Shuttle Run-54.9",3]
["Shuttle Run-55",3]
["Shuttle Run-55.1",3]
["Shuttle Run-55.2",3]
["Shuttle Run-55.3",3]
["Shuttle Run-55.4",3]
["Shuttle Run-55.5",3]
["Shuttle Run-55.6",3]
["Shuttle Run-55.7",3]
["Shuttle Run-55.8",3]
["Shuttle Run-55.9",3]
["Shuttle Run-56",3]
["Shuttle Run-56.1",2]
["Shuttle Run-56.2",2]
["Shuttle Run-56.3",2]
["Shuttle Run-56.4",2]
["Shuttle Run-56.5",2]
["Shuttle Run-56.6",2]
["Shuttle Run-56.7",2]
["Shuttle Run-56.8",2]
["Shuttle Run-56.9",2]
["Shuttle Run-57",2]
["Shuttle Run-57.1",2]
["Shuttle Run-57.2",2]
["Shuttle Run-57.3",2]
["Shuttle Run-57.4",2]
["Shuttle Run-57.5",2]
["Shuttle Run-57.6",2]
["Shuttle Run-57.7",2]
["Shuttle Run-57.8",2]
["Shuttle Run-57.9",2]
["Shuttle Run-58",2]
["Shuttle Run-58.1",1]
["Shuttle Run-58.2",1]
["Shuttle Run-58.3",1]
["Shuttle Run-58.4",1]
["Shuttle Run-58.5",1]
["Shuttle Run-58.6",1]
["Shuttle Run-58.7",1]
["Shuttle Run-58.8",1]
["Shuttle Run-58.9",1]
["Shuttle Run-59",1]
["Shuttle Run-59.1",1]
["Shuttle Run-59.2",1]
["Shuttle Run-59.3",1]
["Shuttle Run-59.4",1]
["Shuttle Run-59.5",1]
["Shuttle Run-59.6",1]
["Shuttle Run-59.7",1]
["Shuttle Run-59.8",1]
["Shuttle Run-59.9",1]
["Shuttle Run-60",1]
["Shuttle Run-60.1",1]
["Shuttle Run-60.2",1]
["Shuttle Run-60.3",1]
["Shuttle Run-60.4",1]
["Shuttle Run-60.5",1]
["Shuttle Run-60.6",1]
["Shuttle Run-60.7",1]
["Shuttle Run-60.8",1]
["Shuttle Run-60.9",1]
["Shuttle Run-61",1]
["Shuttle Run-61.1",1]
["Shuttle Run-61.2",1]
["Shuttle Run-61.3",1]
["Shuttle Run-61.4",1]
["Shuttle Run-61.5",1]
["Shuttle Run-61.6",1]
["Shuttle Run-61.7",1]
["Shuttle Run-61.8",1]
["Shuttle Run-61.9",1]
["Shuttle Run-62",1]
["Shuttle Run-62.1",1]
["Shuttle Run-62.2",1]
["Shuttle Run-62.3",1]
["Shuttle Run-62.4",1]
["Shuttle Run-62.5",1]
["Shuttle Run-62.6",1]
["Shuttle Run-62.7",1]
["Shuttle Run-62.8",1]
["Shuttle Run-62.9",1]
["Shuttle Run-63",1]
["Shuttle Run-63.1",1]
["Shuttle Run-63.2",1]
["Shuttle Run-63.3",1]
["Shuttle Run-63.4",1]
["Shuttle Run-63.5",1]
["Shuttle Run-63.6",1]
["Shuttle Run-63.7",1]
["Shuttle Run-63.8",1]
["Shuttle Run-63.9",1]
["Shuttle Run-64",1]
["Shuttle Run-64.1",1]
["Shuttle Run-64.2",1]
["Shuttle Run-64.3",1]
["Shuttle Run-64.4",1]
["Shuttle Run-64.5",1]
["Shuttle Run-64.6",1]
["Shuttle Run-64.7",1]
["Shuttle Run-64.8",1]
["Shuttle Run-64.9",1]
["Shuttle Run-65",1]
["Shuttle Run-65.1",1]
["Shuttle Run-65.2",1]
["Shuttle Run-65.3",1]
["Shuttle Run-65.4",1]
["Shuttle Run-65.5",1]
["Shuttle Run-65.6",1]
["Shuttle Run-65.7",1]
["Shuttle Run-65.8",1]
["Shuttle Run-65.9",1]
["Shuttle Run-66",1]
["Shuttle Run-66.1",1]
["Shuttle Run-66.2",1]
["Shuttle Run-66.3",1]
["Shuttle Run-66.4",1]
["Shuttle Run-66.5",1]
["Shuttle Run-66.6",1]
["Shuttle Run-66.7",1]
["Shuttle Run-66.8",1]
["Shuttle Run-66.9",1]
["Shuttle Run-67",1]
["Shuttle Run-67.1",1]
["Shuttle Run-67.2",1]
["Shuttle Run-67.3",1]
["Shuttle Run-67.4",1]
["Shuttle Run-67.5",1]
["Shuttle Run-67.6",1]
["Shuttle Run-67.7",1]
["Shuttle Run-67.8",1]
["Shuttle Run-67.9",1]
["Shuttle Run-68",1]
["Shuttle Run-68.1",1]
["Shuttle Run-68.2",1]
["Shuttle Run-68.3",1]
["Shuttle Run-68.4",1]
["Shuttle Run-68.5",1]
["Shuttle Run-68.6",1]
["Shuttle Run-68.7",1]
["Shuttle Run-68.8",1]
["Shuttle Run-68.9",1]
["Shuttle Run-69",1]
["Shuttle Run-69.1",1]
["Shuttle Run-69.2",1]
["Shuttle Run-69.3",1]
["Shuttle Run-69.4",1]
["Shuttle Run-69.5",1]
["Shuttle Run-69.6",1]
["Shuttle Run-69.7",1]
["Shuttle Run-69.8",1]
["Shuttle Run-69.9",1]
["Shuttle Run-70",1]
["Javelin Throw-38",99]
["Javelin Throw-37",97]
["Javelin Throw-36",95]
["Javelin Throw-35",93]
["Javelin Throw-34",91]
["Javelin Throw-33",89]
["Javelin Throw-32",87]
["Javelin Throw-31",85]
["Javelin Throw-30",83]
["Javelin Throw-29",81]
["Javelin Throw-28",79]
["Javelin Throw-27",77]
["Javelin Throw-26",75]
["Javelin Throw-25",73]
["Javelin Throw-24",71]
["Javelin Throw-23",69]
["Javelin Throw-22",66]
["Javelin Throw-21",63]
["Javelin Throw-20",60]
["Javelin Throw-19",57]
["Javelin Throw-18",54]
["Javelin Throw-17",51]
["Javelin Throw-16",48]
["Javelin Throw-15",45]
["Javelin Throw-14",42]
["Javelin Throw-13",39]
["Javelin Throw-12",36]
["Javelin Throw-11",33]
["Javelin Throw-10",30]
["Javelin Throw-9",27]
["Javelin Throw-8",24]
["Javelin Throw-7",20]
["Javelin Throw-6",16]
["Javelin Throw-5",12]
["Javelin Throw-4",8]
["Javelin Throw-3",4]
["Javelin Throw-2",1]
["Javelin Throw-1",1]
["Shot-14",88]
["Shot-13.75",87]
["Shot-13.5",86]
["Shot-13.25",85]
["Shot-13",84]
["Shot-12.75",83]
["Shot-12.5",82]
["Shot-12.25",81]
["Shot-12",80]
["Shot-11.75",79]
["Shot-11.5",78]
["Shot-11.25",77]
["Shot-11",76]
["Shot-10.75",75]
["Shot-10.5",74]
["Shot-10.25",73]
["Shot-10",72]
["Shot-9.75",71]
["Shot-9.5",70]
["Shot-9.25",69]
["Shot-9",68]
["Shot-8.75",67]
["Shot-8.5",66]
["Shot-8.25",65]
["Shot-8",64]
["Shot-7.75",63]
["Shot-7.5",62]
["Shot-7.25",61]
["Shot-7",60]
["Shot-6.75",59]
["Shot-6.5",58]
["Shot-6.25",57]
["Shot-6",56]
["Shot-5.75",54]
["Shot-5.5",52]
["Shot-5.25",50]
["Shot-5",48]
["Shot-4.75",46]
["Shot-4.5",44]
["Shot-4.25",42]
["Shot-4",40]
["Shot-3.75",37]
["Shot-3.5",32]
["Shot-3.25",27]
["Shot-3",22]
["Shot-2.75",17]
["Shot-2.5",12]
["Shot-2.25",10]
["Shot-2",8]
["Shot-1.75",6]
["Shot-1.5",6]
["Shot-1.25",4]
["Shot-1",4]
["Shot-0.75",1]
["Shot-0.5",1]
["Shot-0.25",1]
["Standing Triple Jump-8.50",88]
["Standing Triple Jump-8.49",88]
["Standing Triple Jump-8.48",87]
["Standing Triple Jump-8.47",87]
["Standing Triple Jump-8.46",87]
["Standing Triple Jump-8.45",87]
["Standing Triple Jump-8.44",87]
["Standing Triple Jump-8.43",87]
["Standing Triple Jump-8.42",87]
["Standing Triple Jump-8.41",86]
["Standing Triple Jump-8.40",86]
["Standing Triple Jump-8.39",86]
["Standing Triple Jump-8.38",86]
["Standing Triple Jump-8.37",86]
["Standing Triple Jump-8.36",86]
["Standing Triple Jump-8.35",85]
["Standing Triple Jump-8.34",85]
["Standing Triple Jump-8.33",85]
["Standing Triple Jump-8.32",85]
["Standing Triple Jump-8.31",85]
["Standing Triple Jump-8.30",85]
["Standing Triple Jump-8.29",84]
["Standing Triple Jump-8.28",84]
["Standing Triple Jump-8.27",84]
["Standing Triple Jump-8.26",84]
["Standing Triple Jump-8.25",84]
["Standing Triple Jump-8.24",84]
["Standing Triple Jump-8.23",83]
["Standing Triple Jump-8.22",83]
["Standing Triple Jump-8.21",83]
["Standing Triple Jump-8.20",83]
["Standing Triple Jump-8.19",83]
["Standing Triple Jump-8.18",83]
["Standing Triple Jump-8.17",82]
["Standing Triple Jump-8.16",82]
["Standing Triple Jump-8.15",82]
["Standing Triple Jump-8.14",82]
["Standing Triple Jump-8.13",82]
["Standing Triple Jump-8.12",82]
["Standing Triple Jump-8.11",81]
["Standing Triple Jump-8.10",81]
["Standing Triple Jump-8.09",81]
["Standing Triple Jump-8.08",81]
["Standing Triple Jump-8.07",81]
["Standing Triple Jump-8.06",81]
["Standing Triple Jump-8.05",80]
["Standing Triple Jump-8.04",80]
["Standing Triple Jump-8.03",80]
["Standing Triple Jump-8.02",80]
["Standing Triple Jump-8.01",80]
["Standing Triple Jump-8",80]
["Standing Triple Jump-7.99",79]
["Standing Triple Jump-7.98",79]
["Standing Triple Jump-7.97",79]
["Standing Triple Jump-7.96",79]
["Standing Triple Jump-7.95",79]
["Standing Triple Jump-7.94",79]
["Standing Triple Jump-7.93",79]
["Standing Triple Jump-7.92",79]
["Standing Triple Jump-7.91",79]
["Standing Triple Jump-7.9",79]
["Standing Triple Jump-7.89",79]
["Standing Triple Jump-7.88",79]
["Standing Triple Jump-7.87",79]
["Standing Triple Jump-7.86",78]
["Standing Triple Jump-7.85",78]
["Standing Triple Jump-7.84",78]
["Standing Triple Jump-7.83",78]
["Standing Triple Jump-7.82",78]
["Standing Triple Jump-7.81",78]
["Standing Triple Jump-7.8",78]
["Standing Triple Jump-7.79",78]
["Standing Triple Jump-7.78",78]
["Standing Triple Jump-7.77",78]
["Standing Triple Jump-7.76",78]
["Standing Triple Jump-7.75",78]
["Standing Triple Jump-7.74",77]
["Standing Triple Jump-7.73",77]
["Standing Triple Jump-7.72",77]
["Standing Triple Jump-7.71",77]
["Standing Triple Jump-7.7",77]
["Standing Triple Jump-7.69",77]
["Standing Triple Jump-7.68",77]
["Standing Triple Jump-7.67",77]
["Standing Triple Jump-7.66",76]
["Standing Triple Jump-7.65",76]
["Standing Triple Jump-7.64",76]
["Standing Triple Jump-7.63",76]
["Standing Triple Jump-7.62",76]
["Standing Triple Jump-7.61",76]
["Standing Triple Jump-7.6",76]
["Standing Triple Jump-7.59",76]
["Standing Triple Jump-7.58",76]
["Standing Triple Jump-7.57",76]
["Standing Triple Jump-7.56",76]
["Standing Triple Jump-7.55",76]
["Standing Triple Jump-7.54",76]
["Standing Triple Jump-7.53",76]
["Standing Triple Jump-7.52",76]
["Standing Triple Jump-7.51",76]
["Standing Triple Jump-7.5",76]
["Standing Triple Jump-7.49",75]
["Standing Triple Jump-7.48",75]
["Standing Triple Jump-7.47",75]
["Standing Triple Jump-7.46",75]
["Standing Triple Jump-7.45",75]
["Standing Triple Jump-7.44",75]
["Standing Triple Jump-7.43",75]
["Standing Triple Jump-7.42",75]
["Standing Triple Jump-7.41",75]
["Standing Triple Jump-7.4",75]
["Standing Triple Jump-7.39",75]
["Standing Triple Jump-7.38",75]
["Standing Triple Jump-7.37",75]
["Standing Triple Jump-7.36",74]
["Standing Triple Jump-7.35",74]
["Standing Triple Jump-7.34",74]
["Standing Triple Jump-7.33",74]
["Standing Triple Jump-7.32",74]
["Standing Triple Jump-7.31",74]
["Standing Triple Jump-7.3",74]
["Standing Triple Jump-7.29",74]
["Standing Triple Jump-7.28",74]
["Standing Triple Jump-7.27",74]
["Standing Triple Jump-7.26",74]
["Standing Triple Jump-7.25",74]
["Standing Triple Jump-7.24",73]
["Standing Triple Jump-7.23",73]
["Standing Triple Jump-7.22",73]
["Standing Triple Jump-7.21",73]
["Standing Triple Jump-7.2",73]
["Standing Triple Jump-7.19",73]
["Standing Triple Jump-7.18",73]
["Standing Triple Jump-7.17",73]
["Standing Triple Jump-7.16",73]
["Standing Triple Jump-7.15",73]
["Standing Triple Jump-7.14",73]
["Standing Triple Jump-7.13",73]
["Standing Triple Jump-7.12",72]
["Standing Triple Jump-7.11",72]
["Standing Triple Jump-7.1",72]
["Standing Triple Jump-7.09",72]
["Standing Triple Jump-7.08",72]
["Standing Triple Jump-7.07",72]
["Standing Triple Jump-7.06",72]
["Standing Triple Jump-7.05",72]
["Standing Triple Jump-7.04",71]
["Standing Triple Jump-7.03",71]
["Standing Triple Jump-7.02",71]
["Standing Triple Jump-7.01",71]
["Standing Triple Jump-7",71]
["Standing Triple Jump-6.99",71]
["Standing Triple Jump-6.98",71]
["Standing Triple Jump-6.97",71]
["Standing Triple Jump-6.96",71]
["Standing Triple Jump-6.95",71]
["Standing Triple Jump-6.94",70]
["Standing Triple Jump-6.93",70]
["Standing Triple Jump-6.92",70]
["Standing Triple Jump-6.91",70]
["Standing Triple Jump-6.9",70]
["Standing Triple Jump-6.89",70]
["Standing Triple Jump-6.88",70]
["Standing Triple Jump-6.87",70]
["Standing Triple Jump-6.86",70]
["Standing Triple Jump-6.85",70]
["Standing Triple Jump-6.84",69]
["Standing Triple Jump-6.83",69]
["Standing Triple Jump-6.82",69]
["Standing Triple Jump-6.81",69]
["Standing Triple Jump-6.8",69]
["Standing Triple Jump-6.79",69]
["Standing Triple Jump-6.78",69]
["Standing Triple Jump-6.77",69]
["Standing Triple Jump-6.76",69]
["Standing Triple Jump-6.75",69]
["Standing Triple Jump-6.74",68]
["Standing Triple Jump-6.73",68]
["Standing Triple Jump-6.72",68]
["Standing Triple Jump-6.71",68]
["Standing Triple Jump-6.7",68]
["Standing Triple Jump-6.69",68]
["Standing Triple Jump-6.68",68]
["Standing Triple Jump-6.67",68]
["Standing Triple Jump-6.66",68]
["Standing Triple Jump-6.65",68]
["Standing Triple Jump-6.64",67]
["Standing Triple Jump-6.63",67]
["Standing Triple Jump-6.62",67]
["Standing Triple Jump-6.61",67]
["Standing Triple Jump-6.6",67]
["Standing Triple Jump-6.59",67]
["Standing Triple Jump-6.58",67]
["Standing Triple Jump-6.57",67]
["Standing Triple Jump-6.56",67]
["Standing Triple Jump-6.55",67]
["Standing Triple Jump-6.54",66]
["Standing Triple Jump-6.53",66]
["Standing Triple Jump-6.52",66]
["Standing Triple Jump-6.51",66]
["Standing Triple Jump-6.5",66]
["Standing Triple Jump-6.49",66]
["Standing Triple Jump-6.48",66]
["Standing Triple Jump-6.47",66]
["Standing Triple Jump-6.46",66]
["Standing Triple Jump-6.45",66]
["Standing Triple Jump-6.44",65]
["Standing Triple Jump-6.43",65]
["Standing Triple Jump-6.42",65]
["Standing Triple Jump-6.41",65]
["Standing Triple Jump-6.4",65]
["Standing Triple Jump-6.39",65]
["Standing Triple Jump-6.38",65]
["Standing Triple Jump-6.37",65]
["Standing Triple Jump-6.36",65]
["Standing Triple Jump-6.35",64]
["Standing Triple Jump-6.34",64]
["Standing Triple Jump-6.33",64]
["Standing Triple Jump-6.32",64]
["Standing Triple Jump-6.31",64]
["Standing Triple Jump-6.3",64]
["Standing Triple Jump-6.29",64]
["Standing Triple Jump-6.28",64]
["Standing Triple Jump-6.27",63]
["Standing Triple Jump-6.26",63]
["Standing Triple Jump-6.25",63]
["Standing Triple Jump-6.24",63]
["Standing Triple Jump-6.23",63]
["Standing Triple Jump-6.22",63]
["Standing Triple Jump-6.21",63]
["Standing Triple Jump-6.2",63]
["Standing Triple Jump-6.19",62]
["Standing Triple Jump-6.18",62]
["Standing Triple Jump-6.17",62]
["Standing Triple Jump-6.16",62]
["Standing Triple Jump-6.15",62]
["Standing Triple Jump-6.14",62]
["Standing Triple Jump-6.13",62]
["Standing Triple Jump-6.12",62]
["Standing Triple Jump-6.11",61]
["Standing Triple Jump-6.1",61]
["Standing Triple Jump-6.09",61]
["Standing Triple Jump-6.08",61]
["Standing Triple Jump-6.07",61]
["Standing Triple Jump-6.06",61]
["Standing Triple Jump-6.05",61]
["Standing Triple Jump-6.04",61]
["Standing Triple Jump-6.03",60]
["Standing Triple Jump-6.02",60]
["Standing Triple Jump-6.01",60]
["Standing Triple Jump-6",60]
["Standing Triple Jump-5.99",60]
["Standing Triple Jump-5.98",60]
["Standing Triple Jump-5.97",60]
["Standing Triple Jump-5.96",60]
["Standing Triple Jump-5.95",59]
["Standing Triple Jump-5.94",59]
["Standing Triple Jump-5.93",59]
["Standing Triple Jump-5.92",59]
["Standing Triple Jump-5.91",59]
["Standing Triple Jump-5.9",59]
["Standing Triple Jump-5.89",59]
["Standing Triple Jump-5.88",59]
["Standing Triple Jump-5.87",58]
["Standing Triple Jump-5.86",58]
["Standing Triple Jump-5.85",58]
["Standing Triple Jump-5.84",58]
["Standing Triple Jump-5.83",58]
["Standing Triple Jump-5.82",58]
["Standing Triple Jump-5.81",58]
["Standing Triple Jump-5.8",58]
["Standing Triple Jump-5.79",57]
["Standing Triple Jump-5.78",57]
["Standing Triple Jump-5.77",57]
["Standing Triple Jump-5.76",57]
["Standing Triple Jump-5.75",57]
["Standing Triple Jump-5.74",57]
["Standing Triple Jump-5.73",57]
["Standing Triple Jump-5.72",57]
["Standing Triple Jump-5.71",56]
["Standing Triple Jump-5.7",56]
["Standing Triple Jump-5.69",56]
["Standing Triple Jump-5.68",56]
["Standing Triple Jump-5.67",56]
["Standing Triple Jump-5.66",56]
["Standing Triple Jump-5.65",56]
["Standing Triple Jump-5.64",56]
["Standing Triple Jump-5.63",55]
["Standing Triple Jump-5.62",55]
["Standing Triple Jump-5.61",55]
["Standing Triple Jump-5.6",55]
["Standing Triple Jump-5.59",55]
["Standing Triple Jump-5.58",55]
["Standing Triple Jump-5.57",55]
["Standing Triple Jump-5.56",55]
["Standing Triple Jump-5.55",54]
["Standing Triple Jump-5.54",54]
["Standing Triple Jump-5.53",54]
["Standing Triple Jump-5.52",54]
["Standing Triple Jump-5.51",54]
["Standing Triple Jump-5.5",54]
["Standing Triple Jump-5.49",54]
["Standing Triple Jump-5.48",54]
["Standing Triple Jump-5.47",53]
["Standing Triple Jump-5.46",53]
["Standing Triple Jump-5.45",53]
["Standing Triple Jump-5.44",53]
["Standing Triple Jump-5.43",53]
["Standing Triple Jump-5.42",53]
["Standing Triple Jump-5.41",53]
["Standing Triple Jump-5.4",53]
["Standing Triple Jump-5.39",52]
["Standing Triple Jump-5.38",52]
["Standing Triple Jump-5.37",52]
["Standing Triple Jump-5.36",52]
["Standing Triple Jump-5.35",52]
["Standing Triple Jump-5.34",52]
["Standing Triple Jump-5.33",51]
["Standing Triple Jump-5.32",51]
["Standing Triple Jump-5.31",51]
["Standing Triple Jump-5.3",51]
["Standing Triple Jump-5.29",51]
["Standing Triple Jump-5.28",51]
["Standing Triple Jump-5.27",50]
["Standing Triple Jump-5.26",50]
["Standing Triple Jump-5.25",50]
["Standing Triple Jump-5.24",50]
["Standing Triple Jump-5.23",50]
["Standing Triple Jump-5.22",50]
["Standing Triple Jump-5.21",49]
["Standing Triple Jump-5.2",49]
["Standing Triple Jump-5.19",49]
["Standing Triple Jump-5.18",49]
["Standing Triple Jump-5.17",49]
["Standing Triple Jump-5.16",49]
["Standing Triple Jump-5.15",48]
["Standing Triple Jump-5.14",48]
["Standing Triple Jump-5.13",48]
["Standing Triple Jump-5.12",48]
["Standing Triple Jump-5.11",48]
["Standing Triple Jump-5.1",48]
["Standing Triple Jump-5.09",47]
["Standing Triple Jump-5.08",47]
["Standing Triple Jump-5.07",47]
["Standing Triple Jump-5.06",47]
["Standing Triple Jump-5.05",47]
["Standing Triple Jump-5.04",47]
["Standing Triple Jump-5.03",46]
["Standing Triple Jump-5.02",46]
["Standing Triple Jump-5.01",46]
["Standing Triple Jump-5",46]
["Standing Triple Jump-4.99",46]
["Standing Triple Jump-4.98",46]
["Standing Triple Jump-4.97",45]
["Standing Triple Jump-4.96",45]
["Standing Triple Jump-4.95",45]
["Standing Triple Jump-4.94",45]
["Standing Triple Jump-4.93",45]
["Standing Triple Jump-4.92",45]
["Standing Triple Jump-4.91",44]
["Standing Triple Jump-4.9",44]
["Standing Triple Jump-4.89",44]
["Standing Triple Jump-4.88",44]
["Standing Triple Jump-4.87",44]
["Standing Triple Jump-4.86",44]
["Standing Triple Jump-4.85",43]
["Standing Triple Jump-4.84",43]
["Standing Triple Jump-4.83",43]
["Standing Triple Jump-4.82",43]
["Standing Triple Jump-4.81",43]
["Standing Triple Jump-4.8",43]
["Standing Triple Jump-4.79",42]
["Standing Triple Jump-4.78",42]
["Standing Triple Jump-4.77",42]
["Standing Triple Jump-4.76",42]
["Standing Triple Jump-4.75",42]
["Standing Triple Jump-4.74",41]
["Standing Triple Jump-4.73",41]
["Standing Triple Jump-4.72",41]
["Standing Triple Jump-4.71",41]
["Standing Triple Jump-4.7",41]
["Standing Triple Jump-4.69",40]
["Standing Triple Jump-4.68",40]
["Standing Triple Jump-4.67",40]
["Standing Triple Jump-4.66",40]
["Standing Triple Jump-4.65",40]
["Standing Triple Jump-4.64",39]
["Standing Triple Jump-4.63",39]
["Standing Triple Jump-4.62",39]
["Standing Triple Jump-4.61",39]
["Standing Triple Jump-4.6",39]
["Standing Triple Jump-4.59",38]
["Standing Triple Jump-4.58",38]
["Standing Triple Jump-4.57",38]
["Standing Triple Jump-4.56",38]
["Standing Triple Jump-4.55",38]
["Standing Triple Jump-4.54",37]
["Standing Triple Jump-4.53",37]
["Standing Triple Jump-4.52",37]
["Standing Triple Jump-4.51",37]
["Standing Triple Jump-4.5",37]
["Standing Triple Jump-4.49",36]
["Standing Triple Jump-4.48",36]
["Standing Triple Jump-4.47",36]
["Standing Triple Jump-4.46",36]
["Standing Triple Jump-4.45",36]
["Standing Triple Jump-4.44",35]
["Standing Triple Jump-4.43",35]
["Standing Triple Jump-4.42",35]
["Standing Triple Jump-4.41",35]
["Standing Triple Jump-4.4",35]
["Standing Triple Jump-4.39",34]
["Standing Triple Jump-4.38",34]
["Standing Triple Jump-4.37",34]
["Standing Triple Jump-4.36",34]
["Standing Triple Jump-4.35",34]
["Standing Triple Jump-4.34",33]
["Standing Triple Jump-4.33",33]
["Standing Triple Jump-4.32",33]
["Standing Triple Jump-4.31",33]
["Standing Triple Jump-4.3",33]
["Standing Triple Jump-4.29",32]
["Standing Triple Jump-4.28",32]
["Standing Triple Jump-4.27",32]
["Standing Triple Jump-4.26",32]
["Standing Triple Jump-4.25",32]
["Standing Triple Jump-4.24",31]
["Standing Triple Jump-4.23",31]
["Standing Triple Jump-4.22",31]
["Standing Triple Jump-4.21",31]
["Standing Triple Jump-4.2",31]
["Standing Triple Jump-4.19",30]
["Standing Triple Jump-4.18",30]
["Standing Triple Jump-4.17",30]
["Standing Triple Jump-4.16",30]
["Standing Triple Jump-4.15",30]
["Standing Triple Jump-4.14",29]
["Standing Triple Jump-4.13",29]
["Standing Triple Jump-4.12",29]
["Standing Triple Jump-4.11",29]
["Standing Triple Jump-4.1",29]
["Standing Triple Jump-4.09",28]
["Standing Triple Jump-4.08",28]
["Standing Triple Jump-4.07",28]
["Standing Triple Jump-4.06",28]
["Standing Triple Jump-4.05",28]
["Standing Triple Jump-4.04",27]
["Standing Triple Jump-4.03",27]
["Standing Triple Jump-4.02",27]
["Standing Triple Jump-4.01",27]
["Standing Triple Jump-4",27]
["Standing Triple Jump-3.99",26]
["Standing Triple Jump-3.98",26]
["Standing Triple Jump-3.97",26]
["Standing Triple Jump-3.96",26]
["Standing Triple Jump-3.95",26]
["Standing Triple Jump-3.94",25]
["Standing Triple Jump-3.93",25]
["Standing Triple Jump-3.92",25]
["Standing Triple Jump-3.91",25]
["Standing Triple Jump-3.9",25]
["Standing Triple Jump-3.89",24]
["Standing Triple Jump-3.88",24]
["Standing Triple Jump-3.87",24]
["Standing Triple Jump-3.86",24]
["Standing Triple Jump-3.85",24]
["Standing Triple Jump-3.84",24]
["Standing Triple Jump-3.83",24]
["Standing Triple Jump-3.82",24]
["Standing Triple Jump-3.81",24]
["Standing Triple Jump-3.8",24]
["Standing Triple Jump-3.79",23]
["Standing Triple Jump-3.78",23]
["Standing Triple Jump-3.77",23]
["Standing Triple Jump-3.76",23]
["Standing Triple Jump-3.75",23]
["Standing Triple Jump-3.74",23]
["Standing Triple Jump-3.73",23]
["Standing Triple Jump-3.72",23]
["Standing Triple Jump-3.71",23]
["Standing Triple Jump-3.7",23]
["Standing Triple Jump-3.69",22]
["Standing Triple Jump-3.68",22]
["Standing Triple Jump-3.67",22]
["Standing Triple Jump-3.66",22]
["Standing Triple Jump-3.65",22]
["Standing Triple Jump-3.64",22]
["Standing Triple Jump-3.63",22]
["Standing Triple Jump-3.62",22]
["Standing Triple Jump-3.61",22]
["Standing Triple Jump-3.6",22]
["Standing Triple Jump-3.59",21]
["Standing Triple Jump-3.58",21]
["Standing Triple Jump-3.57",21]
["Standing Triple Jump-3.56",21]
["Standing Triple Jump-3.55",21]
["Standing Triple Jump-3.54",21]
["Standing Triple Jump-3.53",21]
["Standing Triple Jump-3.52",21]
["Standing Triple Jump-3.51",21]
["Standing Triple Jump-3.5",21]
["Standing Triple Jump-3.49",20]
["Standing Triple Jump-3.48",20]
["Standing Triple Jump-3.47",20]
["Standing Triple Jump-3.46",20]
["Standing Triple Jump-3.45",20]
["Standing Triple Jump-3.44",20]
["Standing Triple Jump-3.43",20]
["Standing Triple Jump-3.42",20]
["Standing Triple Jump-3.41",20]
["Standing Triple Jump-3.4",20]
["Standing Triple Jump-3.39",19]
["Standing Triple Jump-3.38",19]
["Standing Triple Jump-3.37",19]
["Standing Triple Jump-3.36",19]
["Standing Triple Jump-3.35",19]
["Standing Triple Jump-3.34",19]
["Standing Triple Jump-3.33",19]
["Standing Triple Jump-3.32",19]
["Standing Triple Jump-3.31",19]
["Standing Triple Jump-3.3",19]
["Standing Triple Jump-3.29",18]
["Standing Triple Jump-3.28",18]
["Standing Triple Jump-3.27",18]
["Standing Triple Jump-3.26",18]
["Standing Triple Jump-3.25",18]
["Standing Triple Jump-3.24",18]
["Standing Triple Jump-3.23",18]
["Standing Triple Jump-3.22",18]
["Standing Triple Jump-3.21",18]
["Standing Triple Jump-3.2",18]
["Standing Triple Jump-3.19",17]
["Standing Triple Jump-3.18",17]
["Standing Triple Jump-3.17",17]
["Standing Triple Jump-3.16",17]
["Standing Triple Jump-3.15",17]
["Standing Triple Jump-3.14",17]
["Standing Triple Jump-3.13",17]
["Standing Triple Jump-3.12",17]
["Standing Triple Jump-3.11",17]
["Standing Triple Jump-3.1",17]
["Standing Triple Jump-3.09",16]
["Standing Triple Jump-3.08",16]
["Standing Triple Jump-3.07",16]
["Standing Triple Jump-3.06",16]
["Standing Triple Jump-3.05",16]
["Standing Triple Jump-3.04",16]
["Standing Triple Jump-3.03",16]
["Standing Triple Jump-3.02",16]
["Standing Triple Jump-3.01",16]
["Standing Triple Jump-3",16]
["Standing Triple Jump-2.99",15]
["Standing Triple Jump-2.98",15]
["Standing Triple Jump-2.97",15]
["Standing Triple Jump-2.96",15]
["Standing Triple Jump-2.95",15]
["Standing Triple Jump-2.94",15]
["Standing Triple Jump-2.93",15]
["Standing Triple Jump-2.92",15]
["Standing Triple Jump-2.91",15]
["Standing Triple Jump-2.9",15]
["Standing Triple Jump-2.89",14]
["Standing Triple Jump-2.88",14]
["Standing Triple Jump-2.87",14]
["Standing Triple Jump-2.86",14]
["Standing Triple Jump-2.85",14]
["Standing Triple Jump-2.84",14]
["Standing Triple Jump-2.83",14]
["Standing Triple Jump-2.82",14]
["Standing Triple Jump-2.81",14]
["Standing Triple Jump-2.8",14]
["Standing Triple Jump-2.79",13]
["Standing Triple Jump-2.78",13]
["Standing Triple Jump-2.77",13]
["Standing Triple Jump-2.76",13]
["Standing Triple Jump-2.75",13]
["Standing Triple Jump-2.74",13]
["Standing Triple Jump-2.73",13]
["Standing Triple Jump-2.72",13]
["Standing Triple Jump-2.71",13]
["Standing Triple Jump-2.7",13]
["Standing Triple Jump-2.69",12]
["Standing Triple Jump-2.68",12]
["Standing Triple Jump-2.67",12]
["Standing Triple Jump-2.66",12]
["Standing Triple Jump-2.65",12]
["Standing Triple Jump-2.64",12]
["Standing Triple Jump-2.63",12]
["Standing Triple Jump-2.62",12]
["Standing Triple Jump-2.61",12]
["Standing Triple Jump-2.6",12]
["Standing Triple Jump-2.59",11]
["Standing Triple Jump-2.58",11]
["Standing Triple Jump-2.57",11]
["Standing Triple Jump-2.56",11]
["Standing Triple Jump-2.55",11]
["Standing Triple Jump-2.54",11]
["Standing Triple Jump-2.53",11]
["Standing Triple Jump-2.52",11]
["Standing Triple Jump-2.51",11]
["Standing Triple Jump-2.5",11]
["Standing Triple Jump-2.49",10]
["Standing Triple Jump-2.48",10]
["Standing Triple Jump-2.47",10]
["Standing Triple Jump-2.46",10]
["Standing Triple Jump-2.45",10]
["Standing Triple Jump-2.44",10]
["Standing Triple Jump-2.43",10]
["Standing Triple Jump-2.42",10]
["Standing Triple Jump-2.41",10]
["Standing Triple Jump-2.4",10]
["Standing Triple Jump-2.39",9]
["Standing Triple Jump-2.38",9]
["Standing Triple Jump-2.37",9]
["Standing Triple Jump-2.36",9]
["Standing Triple Jump-2.35",9]
["Standing Triple Jump-2.34",9]
["Standing Triple Jump-2.33",9]
["Standing Triple Jump-2.32",9]
["Standing Triple Jump-2.31",9]
["Standing Triple Jump-2.3",9]
["Standing Triple Jump-2.29",9]
["Standing Triple Jump-2.28",9]
["Standing Triple Jump-2.27",9]
["Standing Triple Jump-2.26",9]
["Standing Triple Jump-2.25",9]
["Standing Triple Jump-2.24",9]
["Standing Triple Jump-2.23",9]
["Standing Triple Jump-2.22",9]
["Standing Triple Jump-2.21",9]
["Standing Triple Jump-2.2",9]
["Standing Triple Jump-2.19",8]
["Standing Triple Jump-2.18",8]
["Standing Triple Jump-2.17",8]
["Standing Triple Jump-2.16",8]
["Standing Triple Jump-2.15",8]
["Standing Triple Jump-2.14",8]
["Standing Triple Jump-2.13",8]
["Standing Triple Jump-2.12",8]
["Standing Triple Jump-2.11",8]
["Standing Triple Jump-2.1",8]
["Standing Triple Jump-2.09",8]
["Standing Triple Jump-2.08",8]
["Standing Triple Jump-2.07",8]
["Standing Triple Jump-2.06",8]
["Standing Triple Jump-2.05",8]
["Standing Triple Jump-2.04",8]
["Standing Triple Jump-2.03",8]
["Standing Triple Jump-2.02",8]
["Standing Triple Jump-2.01",8]
["Standing Triple Jump-2",8]
["Standing Triple Jump-1.99",7]
["Standing Triple Jump-1.98",7]
["Standing Triple Jump-1.97",7]
["Standing Triple Jump-1.96",7]
["Standing Triple Jump-1.95",7]
["Standing Triple Jump-1.94",7]
["Standing Triple Jump-1.93",7]
["Standing Triple Jump-1.92",7]
["Standing Triple Jump-1.91",7]
["Standing Triple Jump-1.9",7]
["Standing Triple Jump-1.89",6]
["Standing Triple Jump-1.88",6]
["Standing Triple Jump-1.87",6]
["Standing Triple Jump-1.86",6]
["Standing Triple Jump-1.85",6]
["Standing Triple Jump-1.84",6]
["Standing Triple Jump-1.83",6]
["Standing Triple Jump-1.82",6]
["Standing Triple Jump-1.81",6]
["Standing Triple Jump-1.8",6]
["Standing Triple Jump-1.79",5]
["Standing Triple Jump-1.78",5]
["Standing Triple Jump-1.77",5]
["Standing Triple Jump-1.76",5]
["Standing Triple Jump-1.75",5]
["Standing Triple Jump-1.74",5]
["Standing Triple Jump-1.73",5]
["Standing Triple Jump-1.72",5]
["Standing Triple Jump-1.71",5]
["Standing Triple Jump-1.7",5]
["Standing Triple Jump-1.69",4]
["Standing Triple Jump-1.68",4]
["Standing Triple Jump-1.67",4]
["Standing Triple Jump-1.66",4]
["Standing Triple Jump-1.65",4]
["Standing Triple Jump-1.64",4]
["Standing Triple Jump-1.63",4]
["Standing Triple Jump-1.62",4]
["Standing Triple Jump-1.61",4]
["Standing Triple Jump-1.6",4]
["Standing Triple Jump-1.59",4]
["Standing Triple Jump-1.58",4]
["Standing Triple Jump-1.57",4]
["Standing Triple Jump-1.56",4]
["Standing Triple Jump-1.55",4]
["Standing Triple Jump-1.54",4]
["Standing Triple Jump-1.53",4]
["Standing Triple Jump-1.52",4]
["Standing Triple Jump-1.51",4]
["Standing Triple Jump-1.5",4]
["Standing Triple Jump-1.49",3]
["Standing Triple Jump-1.48",3]
["Standing Triple Jump-1.47",3]
["Standing Triple Jump-1.46",3]
["Standing Triple Jump-1.45",3]
["Standing Triple Jump-1.44",3]
["Standing Triple Jump-1.43",3]
["Standing Triple Jump-1.42",3]
["Standing Triple Jump-1.41",3]
["Standing Triple Jump-1.4",3]
["Standing Triple Jump-1.39",3]
["Standing Triple Jump-1.38",3]
["Standing Triple Jump-1.37",3]
["Standing Triple Jump-1.36",3]
["Standing Triple Jump-1.35",3]
["Standing Triple Jump-1.34",3]
["Standing Triple Jump-1.33",3]
["Standing Triple Jump-1.32",3]
["Standing Triple Jump-1.31",3]
["Standing Triple Jump-1.3",3]
["Standing Triple Jump-1.29",2]
["Standing Triple Jump-1.28",2]
["Standing Triple Jump-1.27",2]
["Standing Triple Jump-1.26",2]
["Standing Triple Jump-1.25",2]
["Standing Triple Jump-1.24",2]
["Standing Triple Jump-1.23",2]
["Standing Triple Jump-1.22",2]
["Standing Triple Jump-1.21",2]
["Standing Triple Jump-1.2",2]
["Standing Triple Jump-1.19",2]
["Standing Triple Jump-1.18",2]
["Standing Triple Jump-1.17",2]
["Standing Triple Jump-1.16",2]
["Standing Triple Jump-1.15",2]
["Standing Triple Jump-1.14",2]
["Standing Triple Jump-1.13",2]
["Standing Triple Jump-1.12",2]
["Standing Triple Jump-1.11",2]
["Standing Triple Jump-1.1",2]
["Standing Triple Jump-1.09",1]
["Standing Triple Jump-1.08",1]
["Standing Triple Jump-1.07",1]
["Standing Triple Jump-1.06",1]
["Standing Triple Jump-1.05",1]
["Standing Triple Jump-1.04",1]
["Standing Triple Jump-1.03",1]
["Standing Triple Jump-1.02",1]
["Standing Triple Jump-1.01",1]
["Standing Triple Jump-1",1]

{"sheet":"Individual Points","index":3,"n_rows":56,"n_cols":132,"rows_kept":56,"cut":false,"hidden":false,"merged":[[1,9,3,14]]}
[]
[null,null,null,null,null,null,null,null,null,"Individual Points"]
[]
[null,null,null,null,null,null,null,null,null,null,null,null,null,null,null,null,null,null,null,null,null,null,null,null,null,null,null,null,null,null,null,null,null,null,null,null,null,null,null,null,null,null,null,null,null,null,null,null,null,null,null,null,null,null,null,null,null,null,null,null,"Top 5 Ranking Per Athlete - Boys",null,null,null,null,null,null,null,null,null,null,"Top 5 Ranking Per Athlete - Girls"]
[]
[null,null," Name"," Team"," Year Group"," Age"," Boy or Girl"," Balance Test"," St. Long Jump"," Speed Bounce"," Target Throw"," Overhead Heave"," Hi-Stepper"," Chest Push"," Vertical Jump"," Shuttle Run"," Javelin Throw"," Shot"," St. Triple Jump"," Pentathlon Score"," Pentathlon Award"," Decathlon Score"," Decathlon Award"," Overall Points",null,null,"Balance Test","Standing Long Jump","Speed Bounce","Target Throw","Overhead Heave","Either/Or","Hi-Stepper","Chest Push","Vertical Jump","Shuttle Run","Javelin Throw","Shot","Either/Or","Standing Triple Jump","Adapted Pentathlon Count","Adapted Pentathlon Score","Adapted Pentathlon Award",null,"Decathlon Score","Decathlon Award",null,"Balance Test","Standing Long Jump","Speed Bounce","Either/Or","Hi-Stepper","Chest Push","Vertical Jump","Shuttle Run","Either/Or","Standing Triple Jump",null,"Balance Test","Standing Long Jump","Speed Bounce","Either/Or","Hi-Stepper","Chest Push","Vertical Jump","Shuttle Run","Either/Or","Standing Triple Jump",null,"Balance Test","Standing Long Jump","Speed Bounce","Either/Or","Hi-Stepper","Chest Push","Vertical Jump","Shuttle Run","Either/Or","Standing Triple Jump",null,"Balance Test","Standing Long Jump","Speed Bounce","Either/Or","Hi-Stepper","Chest Push","Vertical Jump","Shuttle Run","Either/Or","Standing Triple Jump",null,"Balance Test","Standing Long Jump","Speed Bounce","Either/Or","Hi-Stepper","Chest Push","Vertical Jump","Shuttle Run","Either/Or","Standing Triple Jump",null,null,null,null,null,null,null,null,null,null,"Balance Test","Standing Long Jump","Speed Bounce","Either/Or","Hi-Stepper","Chest Push","Vertical Jump","Shuttle Run","Either/Or","Standing Triple Jump",null,"Balance Test","Standing Long Jump","Speed Bounce","Either/Or","Hi-Stepper","Chest Push","Vertical Jump","Shuttle Run","Either/Or","Standing Triple Jump"]
[null,null,{"$f":"Input!D11","v":"Nathan Cant"},{"$f":"Input!#REF!","v":{"$error":"#REF!"}},{"$f":"Input!E11","v":6},{"$f":"Input!F11","v":10},{"$f":"Input!G11","v":"BOY"},{"$f":"IF(AA7=0,0,AA7)","v":34},{"$f":"IF(AB7=0,0,AB7)","v":41},{"$f":"IF(AC7=0,0,AC7)","v":31},{"$f":"IF(AD7=0,0,AD7)","v":42},{"$f":"IF(AE7=0,0,AE7)","v":0},{"$f":"IF(AG7=0,0,AG7)","v":25},0,0,0,0,0,{"$f":"IF(AN7=0,0,AN7)","v":0},{"$f":"IF(AP7=0,\" \",AP7)","v":173},{"$f":"IF(AQ7=0,\" \",AQ7)","v":"Step 10"},{"$f":"IF(AS7=0,\" \",AS7)","v":" "},{"$f":"IF(AT7=0,\" \",AT7)","v":" "},{"$f":"SUM(H7:S7)","v":173},{"$f":"CONCATENATE(T7,\"-\",G7,\"-\",E7)","v":"173-BOY-6"},{"$f":"Input!D11","v":"Nathan Cant"},{"$f":"IF(Input!E11=0,0,IF(ISNA(VLOOKUP((CONCATENATE(\"Balance Test-\",Input!H11)),points1,2,)),0,(VLOOKUP((CONCATENATE(\"Balance Test-\",Input!H11)),points1,2,))))","v":34},{"$f":"IF(Input!E11=0,0,IF(ISNA(VLOOKUP((CONCATENATE(\"Standing Long Jump-\",Input!I11)),points1,2,)),0,(VLOOKUP((CONCATENATE(\"Standing Long Jump-\",Input!I11)),points1,2,))))","v":41},{"$f":"IF(Input!E11=0,0,IF(ISNA(VLOOKUP((CONCATENATE(\"Speed Bounce-\",Input!J11)),points1,2,)),0,(VLOOKUP((CONCATENATE(\"Speed Bounce-\",Input!J11)),points1,2,))))","v":31},{"$f":"IF(Input!E11=0,0,IF(ISNA(VLOOKUP((CONCATENATE(\"Target Throw-\",Input!K11)),points1,2,)),0,(VLOOKUP((CONCATENATE(\"Target Throw-\",Input!K11)),points1,2,))))","v":42},{"$f":"IF(Input!E11=0,0,IF(Input!$C11>6,IF(ISNA(VLOOKUP((CONCATENATE(\"Overhead Heave-\",Input!L11)),points1,2,)),0,(VLOOKUP((CONCATENATE(\"Overhead Heave-\",Input!L11)),points1,2,))),0))","v":0},{"$f":"LARGE(AD7:AE7,1)","v":42},{"$f":"IF(Input!E11=0,0,IF(ISNA(VLOOKUP((CONCATENATE(\"Hi-Stepper-\",Input!M11)),points1,2,)),0,(VLOOKUP((CONCATENATE(\"Hi-Stepper-\",Input!M11)),points1,2,))))","v":25},{"$f":"IF(Input!E11=0,0,IF(ISNA(VLOOKUP((CONCATENATE(\"Chest Push-\",Input!N11)),points1,2,)),0,(VLOOKUP((CONCATENATE(\"Chest Push-\",Input!N11)),points1,2,))))","v":0},{"$f":"IF(Input!E11=0,0,IF(ISNA(VLOOKUP((CONCATENATE(\"Vertical Jump-\",Input!O11)),points1,2,)),0,(VLOOKUP((CONCATENATE(\"Vertical Jump-\",Input!O11)),points1,2,))))","v":0},{"$f":"IF(Input!E11=0,0,IF(ISNA(VLOOKUP((CONCATENATE(\"Shuttle Run-\",Input!P11)),points1,2,)),0,(VLOOKUP((CONCATENATE(\"Shuttle Run-\",Input!P11)),points1,2,))))","v":0},{"$f":"IF(Input!E11=0,0,IF(ISNA(VLOOKUP((CONCATENATE(\"Javelin Throw-\",Input!Q11)),points1,2,)),0,(VLOOKUP((CONCATENATE(\"Javelin Throw-\",Input!Q11)),points1,2,))))","v":0},{"$f":"IF(Input!E11=0,0,IF(Input!$C11>6,IF(ISNA(VLOOKUP((CONCATENATE(\"Shot-\",Input!R11)),points1,2,)),0,(VLOOKUP((CONCATENATE(\"Shot-\",Input!R11)),points1,2,))),0))","v":0},{"$f":"LARGE(AK7:AL7,1)","v":0},{"$f":"IF(Input!E11=0,0,IF(ISNA(VLOOKUP((CONCATENATE(\"Standing Triple Jump-\",Input!S11)),points1,2,)),0,(VLOOKUP((CONCATENATE(\"Standing Triple Jump-\",Input!S11)),points1,2,))))","v":0},{"$f":"IF(Input!$C11>6,COUNT(Input!H11:J11,Input!M11:P11,Input!S11,Input!X11:Y11),IF(Input!$C11<=6,COUNT(Input!H11:K11,Input!M11:Q11,Input!S11)))","v":5},{"$f":"IF(AO7>=5,(LARGE((AA7:AC7,AF7:AJ7,AM7:AN7),1))+LARGE((AA7:AC7,AF7:AJ7,AM7:AN7),2)+LARGE((AA7:AC7,AF7:AJ7,AM7:AN7),3)+LARGE((AA7:AC7,AF7:AJ7,AM7:AN7),4)+LARGE((AA7:AC7,AF7:AJ7,AM7:AN7),5),0)","v":173},{"$f":"IF(AP7=0,0,IF((Input!G11=\"Boy\")*AND(Input!C11>6),VLOOKUP(AP7,award2,3),IF((Input!G11=\"Girl\")*AND(Input!C11>6),VLOOKUP(AP7,award2,2),IF((Input!G11=\"Boy\")*AND(Input!C11<=6),VLOOKUP(AP7,award12,3),IF((Input!G11=\"Girl\")*AND(Input!C11<=6),VLOOKUP(AP7,award12,2),0)))))","v":"Step 10"},{"$f":"IF(Input!$C11>6,COUNT(Input!H11:J11,Input!M11:P11,Input!S11,Input!X11:Y11),IF(Input!$C11<=6,COUNT(Input!H11:K11,Input!M11:Q11,Input!S11)))","v":5},{"$f":"IF(AR7=10,(IF(ISNA(SUM(AA7:AC7,AF7:AJ7,AM7:AN7)),0,(SUM(AA7:AC7,AF7:AJ7,AM7:AN7)))),0)","v":0},{"$f":"IF(AS7=0,0,IF((Input!G11=\"Boy\")*AND(Input!C11>6),VLOOKUP(AS7,award2,5),IF((Input!G11=\"Girl\")*AND(Input!C11>6),VLOOKUP(AS7,award2,4),IF((Input!G11=\"Boy\")*AND(Input!C11<=6),VLOOKUP(AS7,award12,5),IF((Input!G11=\"Girl\")*AND(Input!C11<=6),VLOOKUP(AS7,award12,4),0)))))","v":0},null,{"$f":"IF(OR(AA7=0,AA7=\" \"),\" \",AA7+CX7)","v":34.000000999999997},{"$f":"IF(OR(AB7=0,AB7=\" \"),\" \",AB7+CY7)","v":41.000041000000003},{"$f":"IF(OR(AC7=0,AC7=\" \"),\" \",AC7+CZ7)","v":31.000081000000002},{"$f":"IF(OR(AF7=0,AF7=\" \"),\" \",AF7+DA7)","v":42.000121},{"$f":"IF(OR(AG7=0,AG7=\" \"),\" \",AG7+DB7)","v":25.000160999999999},{"$f":"IF(OR(AH7=0,AH7=\" \"),\" \",AH7+DC7)","v":" "},{"$f":"IF(OR(AI7=0,AI7=\" \"),\" \",AI7+DD7)","v":" "},{"$f":"IF(OR(AJ7=0,AJ7=\" \"),\" \",AJ7+DE7)","v":" "},{"$f":"IF(OR(AM7=0,AM7=\" \"),\" \",AM7+DF7)","v":" "},{"$f":"IF(OR(AN7=0,AN7=\" \"),\" \",AN7+DG7)","v":" "},null,{"$f":"IF(AV7=\" \",\" \",IF(Input!$G11=\"Boy\",IF(RANK(AV7,($AV7:$BE7),0)<=5,AV7,\" \"),\" \"))","v":34.000000999999997},{"$f":"IF(AW7=\" \",\" \",IF(Input!$G11=\"Boy\",IF(RANK(AW7,($AV7:$BE7),0)<=5,AW7,\" \"),\" \"))","v":41.000041000000003},{"$f":"IF(AX7=\" \",\" \",IF(Input!$G11=\"Boy\",IF(RANK(AX7,($AV7:$BE7),0)<=5,AX7,\" \"),\" \"))","v":31.000081000000002},{"$f":"IF(AY7=\" \",\" \",IF(Input!$G11=\"Boy\",IF(RANK(AY7,($AV7:$BE7),0)<=5,AY7,\" \"),\" \"))","v":42.000121},{"$f":"IF(AZ7=\" \",\" \",IF(Input!$G11=\"Boy\",IF(RANK(AZ7,($AV7:$BE7),0)<=5,AZ7,\" \"),\" \"))","v":25.000160999999999},{"$f":"IF(BA7=\" \",\" \",IF(Input!$G11=\"Boy\",IF(RANK(BA7,($AV7:$BE7),0)<=5,BA7,\" \"),\" \"))","v":" "},{"$f":"IF(BB7=\" \",\" \",IF(Input!$G11=\"Boy\",IF(RANK(BB7,($AV7:$BE7),0)<=5,BB7,\" \"),\" \"))","v":" "},{"$f":"IF(BC7=\" \",\" \",IF(Input!$G11=\"Boy\",IF(RANK(BC7,($AV7:$BE7),0)<=5,BC7,\" \"),\" \"))","v":" "},{"$f":"IF(BD7=\" \",\" \",IF(Input!$G11=\"Boy\",IF(RANK(BD7,($AV7:$BE7),0)<=5,BD7,\" \"),\" \"))","v":" "},{"$f":"IF(BE7=\" \",\" \",IF(Input!$G11=\"Boy\",IF(RANK(BE7,($AV7:$BE7),0)<=5,BE7,\" \"),\" \"))","v":" "},null,{"$f":"IF(AV7=\" \",\" \",IF(Input!$G11=\"Girl\",IF(RANK(AV7,($AV7:$BE7),0)<=5,AV7,\" \"),\" \"))","v":" "},{"$f":"IF(AW7=\" \",\" \",IF(Input!$G11=\"Girl\",IF(RANK(AW7,($AV7:$BE7),0)<=5,AW7,\" \"),\" \"))","v":" "},{"$f":"IF(AX7=\" \",\" \",IF(Input!$G11=\"Girl\",IF(RANK(AX7,($AV7:$BE7),0)<=5,AX7,\" \"),\" \"))","v":" "},{"$f":"IF(AY7=\" \",\" \",IF(Input!$G11=\"Girl\",IF(RANK(AY7,($AV7:$BE7),0)<=5,AY7,\" \"),\" \"))","v":" "},{"$f":"IF(AZ7=\" \",\" \",IF(Input!$G11=\"Girl\",IF(RANK(AZ7,($AV7:$BE7),0)<=5,AZ7,\" \"),\" \"))","v":" "},{"$f":"IF(BA7=\" \",\" \",IF(Input!$G11=\"Girl\",IF(RANK(BA7,($AV7:$BE7),0)<=5,BA7,\" \"),\" \"))","v":" "},{"$f":"IF(BB7=\" \",\" \",IF(Input!$G11=\"Girl\",IF(RANK(BB7,($AV7:$BE7),0)<=5,BB7,\" \"),\" \"))","v":" "},{"$f":"IF(BC7=\" \",\" \",IF(Input!$G11=\"Girl\",IF(RANK(BC7,($AV7:$BE7),0)<=5,BC7,\" \"),\" \"))","v":" "},{"$f":"IF(BD7=\" \",\" \",IF(Input!$G11=\"Girl\",IF(RANK(BD7,($AV7:$BE7),0)<=5,BD7,\" \"),\" \"))","v":" "},{"$f":"IF(BE7=\" \",\" \",IF(Input!$G11=\"Girl\",IF(RANK(BE7,($AV7:$BE7),0)<=5,BE7,\" \"),\" \"))","v":" "},null,{"$f":"IF(DH7=\" \",\" \",IF(RANK(DH7,$DH$48:$DQ$52,0)<=25,\"RED\",\" \"))","v":{"$error":"#N/A"}},{"$f":"IF(DI7=\" \",\" \",IF(RANK(DI7,$DH$48:$DQ$52,0)<=25,\"RED\",\" \"))","v":"RED"},{"$error":"#N/A"},"RED",{"$error":"#N/A"}," "," "," "," "," ",{"$f":"IF(DR7=\" \",0,IF(RANK(DR7,DR$48:EA$52,0)<=25,\"RED\",0))","v":0},{"$f":"IF(DS7=\" \",\" \",IF(RANK(DS7,$DS$48:$EB$52,0)<=25,\"RED\",\" \"))","v":" "},{"$f":"IF(DT7=\" \",\" \",IF(RANK(DT7,$DS$48:$EB$52,0)<=25,\"RED\",\" \"))","v":" "}," "," "," "," "," "," "," "," ",9.9999999999999995E-7,4.1E-5,8.1000000000000004E-5,1.21E-4,1.6100000000000001E-4,2.0100000000000001E-4,2.41E-4,2.81E-4,3.21E-4,3.6099999999999999E-4,{"$f":"IF(OR(BG7=0,BG7=\" \"),\" \",BG7)","v":34.000000999999997},{"$f":"IF(OR(BH7=0,BH7=\" \"),\" \",BH7)","v":41.000041000000003},31.000081000000002,42.000121,25.000160999999999," "," "," "," "," "," "," "," "," "," "," "," "," "," "," "," "]
[null,null,{"$f":"Input!D12","v":"Hollie Scott"},{"$f":"Input!#REF!","v":{"$error":"#REF!"}},{"$f":"Input!E12","v":5},{"$f":"Input!F12","v":10},{"$f":"Input!G12","v":"GIRL"},{"$f":"IF(AA8=0,0,AA8)","v":42},{"$f":"IF(AB8=0,0,AB8)","v":27},{"$f":"IF(AC8=0,0,AC8)","v":27},21,{"$f":"IF(AE8=0,0,AE8)","v":0},{"$f":"IF(AG8=0,0,AG8)","v":16},{"$f":"IF(AH8=0,0,AH8)","v":0},{"$f":"IF(AI8=0,0,AI8)","v":0},{"$f":"IF(AJ8=0,0,AJ8)","v":0},{"$f":"IF(AK8=0,0,AK8)","v":0},{"$f":"IF(AL8=0,0,AL8)","v":0},{"$f":"IF(AN8=0,0,AN8)","v":0},{"$f":"IF(AP8=0,\" \",AP8)","v":133},{"$f":"IF(AQ8=0,\" \",AQ8)","v":"Step 7"},{"$f":"IF(AS8=0,\" \",AS8)","v":" "},{"$f":"IF(AT8=0,\" \",AT8)","v":" "},{"$f":"SUM(H8:S8)","v":133},"133-GIRL-5",{"$f":"Input!D12","v":"Hollie Scott"},{"$f":"IF(Input!E12=0,0,IF(ISNA(VLOOKUP((CONCATENATE(\"Balance Test-\",Input!H12)),points1,2,)),0,(VLOOKUP((CONCATENATE(\"Balance Test-\",Input!H12)),points1,2,))))","v":42},{"$f":"IF(Input!E12=0,0,IF(ISNA(VLOOKUP((CONCATENATE(\"Standing Long Jump-\",Input!I12)),points1,2,)),0,(VLOOKUP((CONCATENATE(\"Standing Long Jump-\",Input!I12)),points1,2,))))","v":27},{"$f":"IF(Input!E12=0,0,IF(ISNA(VLOOKUP((CONCATENATE(\"Speed Bounce-\",Input!J12)),points1,2,)),0,(VLOOKUP((CONCATENATE(\"Speed Bounce-\",Input!J12)),points1,2,))))","v":27},{"$f":"IF(Input!E12=0,0,IF(ISNA(VLOOKUP((CONCATENATE(\"Target Throw-\",Input!K12)),points1,2,)),0,(VLOOKUP((CONCATENATE(\"Target Throw-\",Input!K12)),points1,2,))))","v":21},{"$f":"IF(Input!E12=0,0,IF(Input!$C12>6,IF(ISNA(VLOOKUP((CONCATENATE(\"Overhead Heave-\",Input!L12)),points1,2,)),0,(VLOOKUP((CONCATENATE(\"Overhead Heave-\",Input!L12)),points1,2,))),0))","v":0},{"$f":"LARGE(AD8:AE8,1)","v":21},{"$f":"IF(Input!E12=0,0,IF(ISNA(VLOOKUP((CONCATENATE(\"Hi-Stepper-\",Input!M12)),points1,2,)),0,(VLOOKUP((CONCATENATE(\"Hi-Stepper-\",Input!M12)),points1,2,))))","v":16},{"$f":"IF(Input!E12=0,0,IF(ISNA(VLOOKUP((CONCATENATE(\"Chest Push-\",Input!N12)),points1,2,)),0,(VLOOKUP((CONCATENATE(\"Chest Push-\",Input!N12)),points1,2,))))","v":0},{"$f":"IF(Input!E12=0,0,IF(ISNA(VLOOKUP((CONCATENATE(\"Vertical Jump-\",Input!O12)),points1,2,)),0,(VLOOKUP((CONCATENATE(\"Vertical Jump-\",Input!O12)),points1,2,))))","v":0},{"$f":"IF(Input!E12=0,0,IF(ISNA(VLOOKUP((CONCATENATE(\"Shuttle Run-\",Input!P12)),points1,2,)),0,(VLOOKUP((CONCATENATE(\"Shuttle Run-\",Input!P12)),points1,2,))))","v":0},{"$f":"IF(Input!E12=0,0,IF(ISNA(VLOOKUP((CONCATENATE(\"Javelin Throw-\",Input!Q12)),points1,2,)),0,(VLOOKUP((CONCATENATE(\"Javelin Throw-\",Input!Q12)),points1,2,))))","v":0},{"$f":"IF(Input!E12=0,0,IF(Input!$C12>6,IF(ISNA(VLOOKUP((CONCATENATE(\"Shot-\",Input!R12)),points1,2,)),0,(VLOOKUP((CONCATENATE(\"Shot-\",Input!R12)),points1,2,))),0))","v":0},{"$f":"LARGE(AK8:AL8,1)","v":0},{"$f":"IF(Input!E12=0,0,IF(ISNA(VLOOKUP((CONCATENATE(\"Standing Triple Jump-\",Input!S12)),points1,2,)),0,(VLOOKUP((CONCATENATE(\"Standing Triple Jump-\",Input!S12)),points1,2,))))","v":0},{"$f":"IF(Input!$C12>6,COUNT(Input!H12:J12,Input!M12:P12,Input!S12,Input!X12:Y12),IF(Input!$C12<=6,COUNT(Input!H12:K12,Input!M12:Q12,Input!S12)))","v":5},{"$f":"IF(AO8>=5,(LARGE((AA8:AC8,AF8:AJ8,AM8:AN8),1))+LARGE((AA8:AC8,AF8:AJ8,AM8:AN8),2)+LARGE((AA8:AC8,AF8:AJ8,AM8:AN8),3)+LARGE((AA8:AC8,AF8:AJ8,AM8:AN8),4)+LARGE((AA8:AC8,AF8:AJ8,AM8:AN8),5),0)","v":133},{"$f":"IF(AP8=0,0,IF((Input!G12=\"Boy\")*AND(Input!C12>6),VLOOKUP(AP8,award2,3),IF((Input!G12=\"Girl\")*AND(Input!C12>6),VLOOKUP(AP8,award2,2),IF((Input!G12=\"Boy\")*AND(Input!C12<=6),VLOOKUP(AP8,award12,3),IF((Input!G12=\"Girl\")*AND(Input!C12<=6),VLOOKUP(AP8,award12,2),0)))))","v":"Step 7"},{"$f":"IF(Input!$C12>6,COUNT(Input!H12:J12,Input!M12:P12,Input!S12,Input!X12:Y12),IF(Input!$C12<=6,COUNT(Input!H12:K12,Input!M12:Q12,Input!S12)))","v":5},{"$f":"IF(AR8=10,(IF(ISNA(SUM(AA8:AC8,AF8:AJ8,AM8:AN8)),0,(SUM(AA8:AC8,AF8:AJ8,AM8:AN8)))),0)","v":0},{"$f":"IF(AS8=0,0,IF((Input!G12=\"Boy\")*AND(Input!C12>6),VLOOKUP(AS8,award2,5),IF((Input!G12=\"Girl\")*AND(Input!C12>6),VLOOKUP(AS8,award2,4),IF((Input!G12=\"Boy\")*AND(Input!C12<=6),VLOOKUP(AS8,award12,5),IF((Input!G12=\"Girl\")*AND(Input!C12<=6),VLOOKUP(AS8,award12,4),0)))))","v":0},null,{"$f":"IF(OR(AA8=0,AA8=\" \"),\" \",AA8+CX8)","v":42.000002000000002},{"$f":"IF(OR(AB8=0,AB8=\" \"),\" \",AB8+CY8)","v":27.000042000000001},{"$f":"IF(OR(AC8=0,AC8=\" \"),\" \",AC8+CZ8)","v":27.000081999999999},{"$f":"IF(OR(AF8=0,AF8=\" \"),\" \",AF8+DA8)","v":21.000122000000001},{"$f":"IF(OR(AG8=0,AG8=\" \"),\" \",AG8+DB8)","v":16.000162},{"$f":"IF(OR(AH8=0,AH8=\" \"),\" \",AH8+DC8)","v":" "},{"$f":"IF(OR(AI8=0,AI8=\" \"),\" \",AI8+DD8)","v":" "},{"$f":"IF(OR(AJ8=0,AJ8=\" \"),\" \",AJ8+DE8)","v":" "},{"$f":"IF(OR(AM8=0,AM8=\" \"),\" \",AM8+DF8)","v":" "},{"$f":"IF(OR(AN8=0,AN8=\" \"),\" \",AN8+DG8)","v":" "},null,{"$f":"IF(AV8=\" \",\" \",IF(Input!$G12=\"Boy\",IF(RANK(AV8,($AV8:$BE8),0)<=5,AV8,\" \"),\" \"))","v":" "},{"$f":"IF(AW8=\" \",\" \",IF(Input!$G12=\"Boy\",IF(RANK(AW8,($AV8:$BE8),0)<=5,AW8,\" \"),\" \"))","v":" "},{"$f":"IF(AX8=\" \",\" \",IF(Input!$G12=\"Boy\",IF(RANK(AX8,($AV8:$BE8),0)<=5,AX8,\" \"),\" \"))","v":" "},{"$f":"IF(AY8=\" \",\" \",IF(Input!$G12=\"Boy\",IF(RANK(AY8,($AV8:$BE8),0)<=5,AY8,\" \"),\" \"))","v":" "},{"$f":"IF(AZ8=\" \",\" \",IF(Input!$G12=\"Boy\",IF(RANK(AZ8,($AV8:$BE8),0)<=5,AZ8,\" \"),\" \"))","v":" "},{"$f":"IF(BA8=\" \",\" \",IF(Input!$G12=\"Boy\",IF(RANK(BA8,($AV8:$BE8),0)<=5,BA8,\" \"),\" \"))","v":" "},{"$f":"IF(BB8=\" \",\" \",IF(Input!$G12=\"Boy\",IF(RANK(BB8,($AV8:$BE8),0)<=5,BB8,\" \"),\" \"))","v":" "},{"$f":"IF(BC8=\" \",\" \",IF(Input!$G12=\"Boy\",IF(RANK(BC8,($AV8:$BE8),0)<=5,BC8,\" \"),\" \"))","v":" "},{"$f":"IF(BD8=\" \",\" \",IF(Input!$G12=\"Boy\",IF(RANK(BD8,($AV8:$BE8),0)<=5,BD8,\" \"),\" \"))","v":" "},{"$f":"IF(BE8=\" \",\" \",IF(Input!$G12=\"Boy\",IF(RANK(BE8,($AV8:$BE8),0)<=5,BE8,\" \"),\" \"))","v":" "},null,{"$f":"IF(AV8=\" \",\" \",IF(Input!$G12=\"Girl\",IF(RANK(AV8,($AV8:$BE8),0)<=5,AV8,\" \"),\" \"))","v":42.000002000000002},{"$f":"IF(AW8=\" \",\" \",IF(Input!$G12=\"Girl\",IF(RANK(AW8,($AV8:$BE8),0)<=5,AW8,\" \"),\" \"))","v":27.000042000000001},{"$f":"IF(AX8=\" \",\" \",IF(Input!$G12=\"Girl\",IF(RANK(AX8,($AV8:$BE8),0)<=5,AX8,\" \"),\" \"))","v":27.000081999999999},{"$f":"IF(AY8=\" \",\" \",IF(Input!$G12=\"Girl\",IF(RANK(AY8,($AV8:$BE8),0)<=5,AY8,\" \"),\" \"))","v":21.000122000000001},{"$f":"IF(AZ8=\" \",\" \",IF(Input!$G12=\"Girl\",IF(RANK(AZ8,($AV8:$BE8),0)<=5,AZ8,\" \"),\" \"))","v":16.000162},{"$f":"IF(BA8=\" \",\" \",IF(Input!$G12=\"Girl\",IF(RANK(BA8,($AV8:$BE8),0)<=5,BA8,\" \"),\" \"))","v":" "},{"$f":"IF(BB8=\" \",\" \",IF(Input!$G12=\"Girl\",IF(RANK(BB8,($AV8:$BE8),0)<=5,BB8,\" \"),\" \"))","v":" "},{"$f":"IF(BC8=\" \",\" \",IF(Input!$G12=\"Girl\",IF(RANK(BC8,($AV8:$BE8),0)<=5,BC8,\" \"),\" \"))","v":" "},{"$f":"IF(BD8=\" \",\" \",IF(Input!$G12=\"Girl\",IF(RANK(BD8,($AV8:$BE8),0)<=5,BD8,\" \"),\" \"))","v":" "},{"$f":"IF(BE8=\" \",\" \",IF(Input!$G12=\"Girl\",IF(RANK(BE8,($AV8:$BE8),0)<=5,BE8,\" \"),\" \"))","v":" "},null,{"$f":"IF(DH8=\" \",\" \",IF(RANK(DH8,$DH$48:$DQ$52,0)<=25,\"RED\",\" \"))","v":" "},{"$f":"IF(DI8=\" \",\" \",IF(RANK(DI8,$DH$48:$DQ$52,0)<=25,\"RED\",\" \"))","v":" "},{"$f":"IF(DJ8=\" \",\" \",IF(RANK(DJ8,$DH$48:$DQ$52,0)<=25,\"RED\",\" \"))","v":" "},{"$f":"IF(DK8=\" \",\" \",IF(RANK(DK8,$DH$48:$DQ$52,0)<=25,\"RED\",\" \"))","v":" "},{"$f":"IF(DL8=\" \",\" \",IF(RANK(DL8,$DH$48:$DQ$52,0)<=25,\"RED\",\" \"))","v":" "},{"$f":"IF(DM8=\" \",\" \",IF(RANK(DM8,$DH$48:$DQ$52,0)<=25,\"RED\",\" \"))","v":" "},{"$f":"IF(DN8=\" \",\" \",IF(RANK(DN8,$DH$48:$DQ$52,0)<=25,\"RED\",\" \"))","v":" "},{"$f":"IF(DO8=\" \",\" \",IF(RANK(DO8,$DH$48:$DQ$52,0)<=25,\"RED\",\" \"))","v":" "},{"$f":"IF(DP8=\" \",\" \",IF(RANK(DP8,$DH$48:$DQ$52,0)<=25,\"RED\",\" \"))","v":" "},{"$f":"IF(DQ8=\" \",\" \",IF(RANK(DQ8,$DH$48:$DQ$52,0)<=25,\"RED\",\" \"))","v":" "},null,{"$f":"IF(DS8=\" \",\" \",IF(RANK(DS8,$DS$48:$EB$52,0)<=25,\"RED\",\" \"))","v":{"$error":"#N/A"}},{"$f":"IF(DT8=\" \",\" \",IF(RANK(DT8,$DS$48:$EB$52,0)<=25,\"RED\",\" \"))","v":{"$error":"#N/A"}},{"$f":"IF(DU8=\" \",\" \",IF(RANK(DU8,$DS$48:$EB$52,0)<=25,\"RED\",\" \"))","v":{"$error":"#N/A"}},{"$f":"IF(DV8=\" \",\" \",IF(RANK(DV8,$DS$48:$EB$52,0)<=25,\"RED\",\" \"))","v":{"$error":"#N/A"}},{"$f":"IF(DW8=\" \",\" \",IF(RANK(DW8,$DS$48:$EB$52,0)<=25,\"RED\",\" \"))","v":{"$error":"#N/A"}},{"$f":"IF(DX8=\" \",\" \",IF(RANK(DX8,$DS$48:$EB$52,0)<=25,\"RED\",\" \"))","v":" "},{"$f":"IF(DY8=\" \",\" \",IF(RANK(DY8,$DS$48:$EB$52,0)<=25,\"RED\",\" \"))","v":" "},{"$f":"IF(DZ8=\" \",\" \",IF(RANK(DZ8,$DS$48:$EB$52,0)<=25,\"RED\",\" \"))","v":" "},{"$f":"IF(EA8=\" \",\" \",IF(RANK(EA8,$DS$48:$EB$52,0)<=25,\"RED\",\" \"))","v":" "},{"$f":"IF(EB8=\" \",\" \",IF(RANK(EB8,$DS$48:$EB$52,0)<=25,\"RED\",\" \"))","v":" "},1.9999999999999999E-6,4.1999999999999998E-5,8.2000000000000001E-5,1.22E-4,1.6200000000000001E-4,2.02E-4,2.42E-4,2.8200000000000002E-4,3.2200000000000002E-4,3.6200000000000002E-4,{"$f":"IF(OR(BG8=0,BG8=\" \"),\" \",BG8)","v":" "},{"$f":"IF(OR(BH8=0,BH8=\" \"),\" \",BH8)","v":" "},{"$f":"IF(OR(BI8=0,BI8=\" \"),\" \",BI8)","v":" "},{"$f":"IF(OR(BJ8=0,BJ8=\" \"),\" \",BJ8)","v":" "},{"$f":"IF(OR(BK8=0,BK8=\" \"),\" \",BK8)","v":" "},{"$f":"IF(OR(BL8=0,BL8=\" \"),\" \",BL8)","v":" "},{"$f":"IF(OR(BM8=0,BM8=\" \"),\" \",BM8)","v":" "},{"$f":"IF(OR(BN8=0,BN8=\" \"),\" \",BN8)","v":" "},{"$f":"IF(OR(BO8=0,BO8=\" \"),\" \",BO8)","v":" "},{"$f":"IF(OR(BP8=0,BP8=\" \"),\" \",BP8)","v":" "},{"$f":"IF(OR(BQ8=0,BQ8=\" \"),\" \",BQ8)","v":" "},{"$f":"IF(OR(BR8=0,BR8=\" \"),\" \",BR8)","v":42.000002000000002},{"$f":"IF(OR(BS8=0,BS8=\" \"),\" \",BS8)","v":27.000042000000001},{"$f":"IF(OR(BT8=0,BT8=\" \"),\" \",BT8)","v":27.000081999999999},{"$f":"IF(OR(BU8=0,BU8=\" \"),\" \",BU8)","v":21.000122000000001},{"$f":"IF(OR(BV8=0,BV8=\" \"),\" \",BV8)","v":16.000162},{"$f":"IF(OR(BW8=0,BW8=\" \"),\" \",BW8)","v":" "},{"$f":"IF(OR(BX8=0,BX8=\" \"),\" \",BX8)","v":" "},{"$f":"IF(OR(BY8=0,BY8=\" \"),\" \",BY8)","v":" "},{"$f":"IF(OR(BZ8=0,BZ8=\" \"),\" \",BZ8)","v":" "},{"$f":"IF(OR(CA8=0,CA8=\" \"),\" \",CA8)","v":" "}]
[null,null,{"$f":"Input!D13","v":"Katie Keane"},{"$f":"Input!#REF!","v":{"$error":"#REF!"}},{"$f":"Input!E13","v":4},{"$f":"Input!F13","v":9},{"$f":"Input!G13","v":"GIRL"},30,15,15,30,0,12,0,0,0,0,0,0,102,"Step 5"," "," ",102,"102-GIRL-4",{"$f":"Input!D13","v":"Katie Keane"},{"$f":"IF(Input!E13=0,0,IF(ISNA(VLOOKUP((CONCATENATE(\"Balance Test-\",Input!H13)),points1,2,)),0,(VLOOKUP((CONCATENATE(\"Balance Test-\",Input!H13)),points1,2,))))","v":30},{"$f":"IF(Input!E13=0,0,IF(ISNA(VLOOKUP((CONCATENATE(\"Standing Long Jump-\",Input!I13)),points1,2,)),0,(VLOOKUP((CONCATENATE(\"Standing Long Jump-\",Input!I13)),points1,2,))))","v":15},{"$f":"IF(Input!E13=0,0,IF(ISNA(VLOOKUP((CONCATENATE(\"Speed Bounce-\",Input!J13)),points1,2,)),0,(VLOOKUP((CONCATENATE(\"Speed Bounce-\",Input!J13)),points1,2,))))","v":15},{"$f":"IF(Input!E13=0,0,IF(ISNA(VLOOKUP((CONCATENATE(\"Target Throw-\",Input!K13)),points1,2,)),0,(VLOOKUP((CONCATENATE(\"Target Throw-\",Input!K13)),points1,2,))))","v":30},{"$f":"IF(Input!E13=0,0,IF(Input!$C13>6,IF(ISNA(VLOOKUP((CONCATENATE(\"Overhead Heave-\",Input!L13)),points1,2,)),0,(VLOOKUP((CONCATENATE(\"Overhead Heave-\",Input!L13)),points1,2,))),0))","v":0},30,{"$f":"IF(Input!E13=0,0,IF(ISNA(VLOOKUP((CONCATENATE(\"Hi-Stepper-\",Input!M13)),points1,2,)),0,(VLOOKUP((CONCATENATE(\"Hi-Stepper-\",Input!M13)),points1,2,))))","v":12},{"$f":"IF(Input!E13=0,0,IF(ISNA(VLOOKUP((CONCATENATE(\"Chest Push-\",Input!N13)),points1,2,)),0,(VLOOKUP((CONCATENATE(\"Chest Push-\",Input!N13)),points1,2,))))","v":0},{"$f":"IF(Input!E13=0,0,IF(ISNA(VLOOKUP((CONCATENATE(\"Vertical Jump-\",Input!O13)),points1,2,)),0,(VLOOKUP((CONCATENATE(\"Vertical Jump-\",Input!O13)),points1,2,))))","v":0},{"$f":"IF(Input!E13=0,0,IF(ISNA(VLOOKUP((CONCATENATE(\"Shuttle Run-\",Input!P13)),points1,2,)),0,(VLOOKUP((CONCATENATE(\"Shuttle Run-\",Input!P13)),points1,2,))))","v":0},{"$f":"IF(Input!E13=0,0,IF(ISNA(VLOOKUP((CONCATENATE(\"Javelin Throw-\",Input!Q13)),points1,2,)),0,(VLOOKUP((CONCATENATE(\"Javelin Throw-\",Input!Q13)),points1,2,))))","v":0},{"$f":"IF(Input!E13=0,0,IF(Input!$C13>6,IF(ISNA(VLOOKUP((CONCATENATE(\"Shot-\",Input!R13)),points1,2,)),0,(VLOOKUP((CONCATENATE(\"Shot-\",Input!R13)),points1,2,))),0))","v":0},0,{"$f":"IF(Input!E13=0,0,IF(ISNA(VLOOKUP((CONCATENATE(\"Standing Triple Jump-\",Input!S13)),points1,2,)),0,(VLOOKUP((CONCATENATE(\"Standing Triple Jump-\",Input!S13)),points1,2,))))","v":0},{"$f":"IF(Input!$C13>6,COUNT(Input!H13:J13,Input!M13:P13,Input!S13,Input!X13:Y13),IF(Input!$C13<=6,COUNT(Input!H13:K13,Input!M13:Q13,Input!S13)))","v":5},{"$f":"IF(AO9>=5,(LARGE((AA9:AC9,AF9:AJ9,AM9:AN9),1))+LARGE((AA9:AC9,AF9:AJ9,AM9:AN9),2)+LARGE((AA9:AC9,AF9:AJ9,AM9:AN9),3)+LARGE((AA9:AC9,AF9:AJ9,AM9:AN9),4)+LARGE((AA9:AC9,AF9:AJ9,AM9:AN9),5),0)","v":102},{"$f":"IF(AP9=0,0,IF((Input!G13=\"Boy\")*AND(Input!C13>6),VLOOKUP(AP9,award2,3),IF((Input!G13=\"Girl\")*AND(Input!C13>6),VLOOKUP(AP9,award2,2),IF((Input!G13=\"Boy\")*AND(Input!C13<=6),VLOOKUP(AP9,award12,3),IF((Input!G13=\"Girl\")*AND(Input!C13<=6),VLOOKUP(AP9,award12,2),0)))))","v":"Step 5"},{"$f":"IF(Input!$C13>6,COUNT(Input!H13:J13,Input!M13:P13,Input!S13,Input!X13:Y13),IF(Input!$C13<=6,COUNT(Input!H13:K13,Input!M13:Q13,Input!S13)))","v":5},0,{"$f":"IF(AS9=0,0,IF((Input!G13=\"Boy\")*AND(Input!C13>6),VLOOKUP(AS9,award2,5),IF((Input!G13=\"Girl\")*AND(Input!C13>6),VLOOKUP(AS9,award2,4),IF((Input!G13=\"Boy\")*AND(Input!C13<=6),VLOOKUP(AS9,award12,5),IF((Input!G13=\"Girl\")*AND(Input!C13<=6),VLOOKUP(AS9,award12,4),0)))))","v":0},null,30.000003,15.000043,15.000083,30.000122999999999,12.000163000000001," "," "," "," "," ",null,{"$f":"IF(AV9=\" \",\" \",IF(Input!$G13=\"Boy\",IF(RANK(AV9,($AV9:$BE9),0)<=5,AV9,\" \"),\" \"))","v":" "},{"$f":"IF(AW9=\" \",\" \",IF(Input!$G13=\"Boy\",IF(RANK(AW9,($AV9:$BE9),0)<=5,AW9,\" \"),\" \"))","v":" "},{"$f":"IF(AX9=\" \",\" \",IF(Input!$G13=\"Boy\",IF(RANK(AX9,($AV9:$BE9),0)<=5,AX9,\" \"),\" \"))","v":" "},{"$f":"IF(AY9=\" \",\" \",IF(Input!$G13=\"Boy\",IF(RANK(AY9,($AV9:$BE9),0)<=5,AY9,\" \"),\" \"))","v":" "},{"$f":"IF(AZ9=\" \",\" \",IF(Input!$G13=\"Boy\",IF(RANK(AZ9,($AV9:$BE9),0)<=5,AZ9,\" \"),\" \"))","v":" "},{"$f":"IF(BA9=\" \",\" \",IF(Input!$G13=\"Boy\",IF(RANK(BA9,($AV9:$BE9),0)<=5,BA9,\" \"),\" \"))","v":" "},{"$f":"IF(BB9=\" \",\" \",IF(Input!$G13=\"Boy\",IF(RANK(BB9,($AV9:$BE9),0)<=5,BB9,\" \"),\" \"))","v":" "},{"$f":"IF(BC9=\" \",\" \",IF(Input!$G13=\"Boy\",IF(RANK(BC9,($AV9:$BE9),0)<=5,BC9,\" \"),\" \"))","v":" "},{"$f":"IF(BD9=\" \",\" \",IF(Input!$G13=\"Boy\",IF(RANK(BD9,($AV9:$BE9),0)<=5,BD9,\" \"),\" \"))","v":" "},{"$f":"IF(BE9=\" \",\" \",IF(Input!$G13=\"Boy\",IF(RANK(BE9,($AV9:$BE9),0)<=5,BE9,\" \"),\" \"))","v":" "},null,{"$f":"IF(AV9=\" \",\" \",IF(Input!$G13=\"Girl\",IF(RANK(AV9,($AV9:$BE9),0)<=5,AV9,\" \"),\" \"))","v":30.000003},{"$f":"IF(AW9=\" \",\" \",IF(Input!$G13=\"Girl\",IF(RANK(AW9,($AV9:$BE9),0)<=5,AW9,\" \"),\" \"))","v":15.000043},{"$f":"IF(AX9=\" \",\" \",IF(Input!$G13=\"Girl\",IF(RANK(AX9,($AV9:$BE9),0)<=5,AX9,\" \"),\" \"))","v":15.000083},{"$f":"IF(AY9=\" \",\" \",IF(Input!$G13=\"Girl\",IF(RANK(AY9,($AV9:$BE9),0)<=5,AY9,\" \"),\" \"))","v":30.000122999999999},{"$f":"IF(AZ9=\" \",\" \",IF(Input!$G13=\"Girl\",IF(RANK(AZ9,($AV9:$BE9),0)<=5,AZ9,\" \"),\" \"))","v":12.000163000000001},{"$f":"IF(BA9=\" \",\" \",IF(Input!$G13=\"Girl\",IF(RANK(BA9,($AV9:$BE9),0)<=5,BA9,\" \"),\" \"))","v":" "},{"$f":"IF(BB9=\" \",\" \",IF(Input!$G13=\"Girl\",IF(RANK(BB9,($AV9:$BE9),0)<=5,BB9,\" \"),\" \"))","v":" "},{"$f":"IF(BC9=\" \",\" \",IF(Input!$G13=\"Girl\",IF(RANK(BC9,($AV9:$BE9),0)<=5,BC9,\" \"),\" \"))","v":" "},{"$f":"IF(BD9=\" \",\" \",IF(Input!$G13=\"Girl\",IF(RANK(BD9,($AV9:$BE9),0)<=5,BD9,\" \"),\" \"))","v":" "},{"$f":"IF(BE9=\" \",\" \",IF(Input!$G13=\"Girl\",IF(RANK(BE9,($AV9:$BE9),0)<=5,BE9,\" \"),\" \"))","v":" "},null," "," "," "," "," "," "," "," "," "," ",null,{"$error":"#N/A"},{"$error":"#N/A"},{"$error":"#N/A"},{"$error":"#N/A"},{"$error":"#N/A"}," "," "," "," "," ",3.0000000000000001E-6,4.3000000000000002E-5,8.2999999999999998E-5,1.2300000000000001E-4,1.63E-4,2.03E-4,2.43E-4,2.8299999999999999E-4,3.2299999999999999E-4,3.6299999999999999E-4," "," "," "," "," "," "," "," "," "," "," ",30.000003,15.000043,15.000083,30.000122999999999,12.000163000000001," "," "," "," "," "]
[null,null,{"$f":"Input!D14","v":"Sophie Ford"},{"$f":"Input!#REF!","v":{"$error":"#REF!"}},{"$f":"Input!E14","v":5},{"$f":"Input!F14","v":9},{"$f":"Input!G14","v":"GIRL"},65,24,24,51,0,15,0,0,0,0,0,0,179,"Bronze"," "," ",179,"179-GIRL-5",{"$f":"Input!D14","v":"Sophie Ford"},{"$f":"IF(Input!E14=0,0,IF(ISNA(VLOOKUP((CONCATENATE(\"Balance Test-\",Input!H14)),points1,2,)),0,(VLOOKUP((CONCATENATE(\"Balance Test-\",Input!H14)),points1,2,))))","v":65},{"$f":"IF(Input!E14=0,0,IF(ISNA(VLOOKUP((CONCATENATE(\"Standing Long Jump-\",Input!I14)),points1,2,)),0,(VLOOKUP((CONCATENATE(\"Standing Long Jump-\",Input!I14)),points1,2,))))","v":24},{"$f":"IF(Input!E14=0,0,IF(ISNA(VLOOKUP((CONCATENATE(\"Speed Bounce-\",Input!J14)),points1,2,)),0,(VLOOKUP((CONCATENATE(\"Speed Bounce-\",Input!J14)),points1,2,))))","v":24},{"$f":"IF(Input!E14=0,0,IF(ISNA(VLOOKUP((CONCATENATE(\"Target Throw-\",Input!K14)),points1,2,)),0,(VLOOKUP((CONCATENATE(\"Target Throw-\",Input!K14)),points1,2,))))","v":51},{"$f":"IF(Input!E14=0,0,IF(Input!$C14>6,IF(ISNA(VLOOKUP((CONCATENATE(\"Overhead Heave-\",Input!L14)),points1,2,)),0,(VLOOKUP((CONCATENATE(\"Overhead Heave-\",Input!L14)),points1,2,))),0))","v":0},51,{"$f":"IF(Input!E14=0,0,IF(ISNA(VLOOKUP((CONCATENATE(\"Hi-Stepper-\",Input!M14)),points1,2,)),0,(VLOOKUP((CONCATENATE(\"Hi-Stepper-\",Input!M14)),points1,2,))))","v":15},{"$f":"IF(Input!E14=0,0,IF(ISNA(VLOOKUP((CONCATENATE(\"Chest Push-\",Input!N14)),points1,2,)),0,(VLOOKUP((CONCATENATE(\"Chest Push-\",Input!N14)),points1,2,))))","v":0},{"$f":"IF(Input!E14=0,0,IF(ISNA(VLOOKUP((CONCATENATE(\"Vertical Jump-\",Input!O14)),points1,2,)),0,(VLOOKUP((CONCATENATE(\"Vertical Jump-\",Input!O14)),points1,2,))))","v":0},{"$f":"IF(Input!E14=0,0,IF(ISNA(VLOOKUP((CONCATENATE(\"Shuttle Run-\",Input!P14)),points1,2,)),0,(VLOOKUP((CONCATENATE(\"Shuttle Run-\",Input!P14)),points1,2,))))","v":0},{"$f":"IF(Input!E14=0,0,IF(ISNA(VLOOKUP((CONCATENATE(\"Javelin Throw-\",Input!Q14)),points1,2,)),0,(VLOOKUP((CONCATENATE(\"Javelin Throw-\",Input!Q14)),points1,2,))))","v":0},{"$f":"IF(Input!E14=0,0,IF(Input!$C14>6,IF(ISNA(VLOOKUP((CONCATENATE(\"Shot-\",Input!R14)),points1,2,)),0,(VLOOKUP((CONCATENATE(\"Shot-\",Input!R14)),points1,2,))),0))","v":0},0,{"$f":"IF(Input!E14=0,0,IF(ISNA(VLOOKUP((CONCATENATE(\"Standing Triple Jump-\",Input!S14)),points1,2,)),0,(VLOOKUP((CONCATENATE(\"Standing Triple Jump-\",Input!S14)),points1,2,))))","v":0},{"$f":"IF(Input!$C14>6,COUNT(Input!H14:J14,Input!M14:P14,Input!S14,Input!X14:Y14),IF(Input!$C14<=6,COUNT(Input!H14:K14,Input!M14:Q14,Input!S14)))","v":5},{"$f":"IF(AO10>=5,(LARGE((AA10:AC10,AF10:AJ10,AM10:AN10),1))+LARGE((AA10:AC10,AF10:AJ10,AM10:AN10),2)+LARGE((AA10:AC10,AF10:AJ10,AM10:AN10),3)+LARGE((AA10:AC10,AF10:AJ10,AM10:AN10),4)+LARGE((AA10:AC10,AF10:AJ10,AM10:AN10),5),0)","v":179},{"$f":"IF(AP10=0,0,IF((Input!G14=\"Boy\")*AND(Input!C14>6),VLOOKUP(AP10,award2,3),IF((Input!G14=\"Girl\")*AND(Input!C14>6),VLOOKUP(AP10,award2,2),IF((Input!G14=\"Boy\")*AND(Input!C14<=6),VLOOKUP(AP10,award12,3),IF((Input!G14=\"Girl\")*AND(Input!C14<=6),VLOOKUP(AP10,award12,2),0)))))","v":"Bronze"},{"$f":"IF(Input!$C14>6,COUNT(Input!H14:J14,Input!M14:P14,Input!S14,Input!X14:Y14),IF(Input!$C14<=6,COUNT(Input!H14:K14,Input!M14:Q14,Input!S14)))","v":5},0,{"$f":"IF(AS10=0,0,IF((Input!G14=\"Boy\")*AND(Input!C14>6),VLOOKUP(AS10,award2,5),IF((Input!G14=\"Girl\")*AND(Input!C14>6),VLOOKUP(AS10,award2,4),IF((Input!G14=\"Boy\")*AND(Input!C14<=6),VLOOKUP(AS10,award12,5),IF((Input!G14=\"Girl\")*AND(Input!C14<=6),VLOOKUP(AS10,award12,4),0)))))","v":0},null,65.000004000000004,24.000043999999999,24.000084000000001,51.000124,15.000164," "," "," "," "," ",null,{"$f":"IF(AV10=\" \",\" \",IF(Input!$G14=\"Boy\",IF(RANK(AV10,($AV10:$BE10),0)<=5,AV10,\" \"),\" \"))","v":" "},{"$f":"IF(AW10=\" \",\" \",IF(Input!$G14=\"Boy\",IF(RANK(AW10,($AV10:$BE10),0)<=5,AW10,\" \"),\" \"))","v":" "},{"$f":"IF(AX10=\" \",\" \",IF(Input!$G14=\"Boy\",IF(RANK(AX10,($AV10:$BE10),0)<=5,AX10,\" \"),\" \"))","v":" "},{"$f":"IF(AY10=\" \",\" \",IF(Input!$G14=\"Boy\",IF(RANK(AY10,($AV10:$BE10),0)<=5,AY10,\" \"),\" \"))","v":" "},{"$f":"IF(AZ10=\" \",\" \",IF(Input!$G14=\"Boy\",IF(RANK(AZ10,($AV10:$BE10),0)<=5,AZ10,\" \"),\" \"))","v":" "},{"$f":"IF(BA10=\" \",\" \",IF(Input!$G14=\"Boy\",IF(RANK(BA10,($AV10:$BE10),0)<=5,BA10,\" \"),\" \"))","v":" "},{"$f":"IF(BB10=\" \",\" \",IF(Input!$G14=\"Boy\",IF(RANK(BB10,($AV10:$BE10),0)<=5,BB10,\" \"),\" \"))","v":" "},{"$f":"IF(BC10=\" \",\" \",IF(Input!$G14=\"Boy\",IF(RANK(BC10,($AV10:$BE10),0)<=5,BC10,\" \"),\" \"))","v":" "},{"$f":"IF(BD10=\" \",\" \",IF(Input!$G14=\"Boy\",IF(RANK(BD10,($AV10:$BE10),0)<=5,BD10,\" \"),\" \"))","v":" "},{"$f":"IF(BE10=\" \",\" \",IF(Input!$G14=\"Boy\",IF(RANK(BE10,($AV10:$BE10),0)<=5,BE10,\" \"),\" \"))","v":" "},null,{"$f":"IF(AV10=\" \",\" \",IF(Input!$G14=\"Girl\",IF(RANK(AV10,($AV10:$BE10),0)<=5,AV10,\" \"),\" \"))","v":65.000004000000004},{"$f":"IF(AW10=\" \",\" \",IF(Input!$G14=\"Girl\",IF(RANK(AW10,($AV10:$BE10),0)<=5,AW10,\" \"),\" \"))","v":24.000043999999999},{"$f":"IF(AX10=\" \",\" \",IF(Input!$G14=\"Girl\",IF(RANK(AX10,($AV10:$BE10),0)<=5,AX10,\" \"),\" \"))","v":24.000084000000001},{"$f":"IF(AY10=\" \",\" \",IF(Input!$G14=\"Girl\",IF(RANK(AY10,($AV10:$BE10),0)<=5,AY10,\" \"),\" \"))","v":51.000124},{"$f":"IF(AZ10=\" \",\" \",IF(Input!$G14=\"Girl\",IF(RANK(AZ10,($AV10:$BE10),0)<=5,AZ10,\" \"),\" \"))","v":15.000164},{"$f":"IF(BA10=\" \",\" \",IF(Input!$G14=\"Girl\",IF(RANK(BA10,($AV10:$BE10),0)<=5,BA10,\" \"),\" \"))","v":" "},{"$f":"IF(BB10=\" \",\" \",IF(Input!$G14=\"Girl\",IF(RANK(BB10,($AV10:$BE10),0)<=5,BB10,\" \"),\" \"))","v":" "},{"$f":"IF(BC10=\" \",\" \",IF(Input!$G14=\"Girl\",IF(RANK(BC10,($AV10:$BE10),0)<=5,BC10,\" \"),\" \"))","v":" "},{"$f":"IF(BD10=\" \",\" \",IF(Input!$G14=\"Girl\",IF(RANK(BD10,($AV10:$BE10),0)<=5,BD10,\" \"),\" \"))","v":" "},{"$f":"IF(BE10=\" \",\" \",IF(Input!$G14=\"Girl\",IF(RANK(BE10,($AV10:$BE10),0)<=5,BE10,\" \"),\" \"))","v":" "},null," "," "," "," "," "," "," "," "," "," ",null,"RED",{"$error":"#N/A"},{"$error":"#N/A"},"RED",{"$error":"#N/A"}," "," "," "," "," ",3.9999999999999998E-6,4.3999999999999999E-5,8.3999999999999995E-5,1.2400000000000001E-4,1.64E-4,2.04E-4,2.4399999999999999E-4,2.8400000000000002E-4,3.2400000000000001E-4,3.6400000000000001E-4," "," "," "," "," "," "," "," "," "," "," ",65.000004000000004,24.000043999999999,24.000084000000001,51.000124,15.000164," "," "," "," "," "]
[null,null,{"$f":"Input!D15","v":"Katie Killick"},{"$f":"Input!#REF!","v":{"$error":"#REF!"}},{"$f":"Input!E15","v":6},{"$f":"Input!F15","v":10},{"$f":"Input!G15","v":"GIRL"},65,46,36,24,0,25,0,0,0,0,0,0,196,"Bronze"," "," ",196,"196-GIRL-6",{"$f":"Input!D15","v":"Katie Killick"},{"$f":"IF(Input!E15=0,0,IF(ISNA(VLOOKUP((CONCATENATE(\"Balance Test-\",Input!H15)),points1,2,)),0,(VLOOKUP((CONCATENATE(\"Balance Test-\",Input!H15)),points1,2,))))","v":65},{"$f":"IF(Input!E15=0,0,IF(ISNA(VLOOKUP((CONCATENATE(\"Standing Long Jump-\",Input!I15)),points1,2,)),0,(VLOOKUP((CONCATENATE(\"Standing Long Jump-\",Input!I15)),points1,2,))))","v":46},{"$f":"IF(Input!E15=0,0,IF(ISNA(VLOOKUP((CONCATENATE(\"Speed Bounce-\",Input!J15)),points1,2,)),0,(VLOOKUP((CONCATENATE(\"Speed Bounce-\",Input!J15)),points1,2,))))","v":36},{"$f":"IF(Input!E15=0,0,IF(ISNA(VLOOKUP((CONCATENATE(\"Target Throw-\",Input!K15)),points1,2,)),0,(VLOOKUP((CONCATENATE(\"Target Throw-\",Input!K15)),points1,2,))))","v":24},{"$f":"IF(Input!E15=0,0,IF(Input!$C15>6,IF(ISNA(VLOOKUP((CONCATENATE(\"Overhead Heave-\",Input!L15)),points1,2,)),0,(VLOOKUP((CONCATENATE(\"Overhead Heave-\",Input!L15)),points1,2,))),0))","v":0},24,{"$f":"IF(Input!E15=0,0,IF(ISNA(VLOOKUP((CONCATENATE(\"Hi-Stepper-\",Input!M15)),points1,2,)),0,(VLOOKUP((CONCATENATE(\"Hi-Stepper-\",Input!M15)),points1,2,))))","v":25},{"$f":"IF(Input!E15=0,0,IF(ISNA(VLOOKUP((CONCATENATE(\"Chest Push-\",Input!N15)),points1,2,)),0,(VLOOKUP((CONCATENATE(\"Chest Push-\",Input!N15)),points1,2,))))","v":0},{"$f":"IF(Input!E15=0,0,IF(ISNA(VLOOKUP((CONCATENATE(\"Vertical Jump-\",Input!O15)),points1,2,)),0,(VLOOKUP((CONCATENATE(\"Vertical Jump-\",Input!O15)),points1,2,))))","v":0},{"$f":"IF(Input!E15=0,0,IF(ISNA(VLOOKUP((CONCATENATE(\"Shuttle Run-\",Input!P15)),points1,2,)),0,(VLOOKUP((CONCATENATE(\"Shuttle Run-\",Input!P15)),points1,2,))))","v":0},{"$f":"IF(Input!E15=0,0,IF(ISNA(VLOOKUP((CONCATENATE(\"Javelin Throw-\",Input!Q15)),points1,2,)),0,(VLOOKUP((CONCATENATE(\"Javelin Throw-\",Input!Q15)),points1,2,))))","v":0},{"$f":"IF(Input!E15=0,0,IF(Input!$C15>6,IF(ISNA(VLOOKUP((CONCATENATE(\"Shot-\",Input!R15)),points1,2,)),0,(VLOOKUP((CONCATENATE(\"Shot-\",Input!R15)),points1,2,))),0))","v":0},0,{"$f":"IF(Input!E15=0,0,IF(ISNA(VLOOKUP((CONCATENATE(\"Standing Triple Jump-\",Input!S15)),points1,2,)),0,(VLOOKUP((CONCATENATE(\"Standing Triple Jump-\",Input!S15)),points1,2,))))","v":0},{"$f":"IF(Input!$C15>6,COUNT(Input!H15:J15,Input!M15:P15,Input!S15,Input!X15:Y15),IF(Input!$C15<=6,COUNT(Input!H15:K15,Input!M15:Q15,Input!S15)))","v":5},{"$f":"IF(AO11>=5,(LARGE((AA11:AC11,AF11:AJ11,AM11:AN11),1))+LARGE((AA11:AC11,AF11:AJ11,AM11:AN11),2)+LARGE((AA11:AC11,AF11:AJ11,AM11:AN11),3)+LARGE((AA11:AC11,AF11:AJ11,AM11:AN11),4)+LARGE((AA11:AC11,AF11:AJ11,AM11:AN11),5),0)","v":196},{"$f":"IF(AP11=0,0,IF((Input!G15=\"Boy\")*AND(Input!C15>6),VLOOKUP(AP11,award2,3),IF((Input!G15=\"Girl\")*AND(Input!C15>6),VLOOKUP(AP11,award2,2),IF((Input!G15=\"Boy\")*AND(Input!C15<=6),VLOOKUP(AP11,award12,3),IF((Input!G15=\"Girl\")*AND(Input!C15<=6),VLOOKUP(AP11,award12,2),0)))))","v":"Bronze"},{"$f":"IF(Input!$C15>6,COUNT(Input!H15:J15,Input!M15:P15,Input!S15,Input!X15:Y15),IF(Input!$C15<=6,COUNT(Input!H15:K15,Input!M15:Q15,Input!S15)))","v":5},0,{"$f":"IF(AS11=0,0,IF((Input!G15=\"Boy\")*AND(Input!C15>6),VLOOKUP(AS11,award2,5),IF((Input!G15=\"Girl\")*AND(Input!C15>6),VLOOKUP(AS11,award2,4),IF((Input!G15=\"Boy\")*AND(Input!C15<=6),VLOOKUP(AS11,award12,5),IF((Input!G15=\"Girl\")*AND(Input!C15<=6),VLOOKUP(AS11,award12,4),0)))))","v":0},null,65.000005000000002,46.000045,36.000084999999999,24.000125000000001,25.000164999999999," "," "," "," "," ",null,{"$f":"IF(AV11=\" \",\" \",IF(Input!$G15=\"Boy\",IF(RANK(AV11,($AV11:$BE11),0)<=5,AV11,\" \"),\" \"))","v":" "},{"$f":"IF(AW11=\" \",\" \",IF(Input!$G15=\"Boy\",IF(RANK(AW11,($AV11:$BE11),0)<=5,AW11,\" \"),\" \"))","v":" "},{"$f":"IF(AX11=\" \",\" \",IF(Input!$G15=\"Boy\",IF(RANK(AX11,($AV11:$BE11),0)<=5,AX11,\" \"),\" \"))","v":" "},{"$f":"IF(AY11=\" \",\" \",IF(Input!$G15=\"Boy\",IF(RANK(AY11,($AV11:$BE11),0)<=5,AY11,\" \"),\" \"))","v":" "},{"$f":"IF(AZ11=\" \",\" \",IF(Input!$G15=\"Boy\",IF(RANK(AZ11,($AV11:$BE11),0)<=5,AZ11,\" \"),\" \"))","v":" "},{"$f":"IF(BA11=\" \",\" \",IF(Input!$G15=\"Boy\",IF(RANK(BA11,($AV11:$BE11),0)<=5,BA11,\" \"),\" \"))","v":" "},{"$f":"IF(BB11=\" \",\" \",IF(Input!$G15=\"Boy\",IF(RANK(BB11,($AV11:$BE11),0)<=5,BB11,\" \"),\" \"))","v":" "},{"$f":"IF(BC11=\" \",\" \",IF(Input!$G15=\"Boy\",IF(RANK(BC11,($AV11:$BE11),0)<=5,BC11,\" \"),\" \"))","v":" "},{"$f":"IF(BD11=\" \",\" \",IF(Input!$G15=\"Boy\",IF(RANK(BD11,($AV11:$BE11),0)<=5,BD11,\" \"),\" \"))","v":" "},{"$f":"IF(BE11=\" \",\" \",IF(Input!$G15=\"Boy\",IF(RANK(BE11,($AV11:$BE11),0)<=5,BE11,\" \"),\" \"))","v":" "},null,{"$f":"IF(AV11=\" \",\" \",IF(Input!$G15=\"Girl\",IF(RANK(AV11,($AV11:$BE11),0)<=5,AV11,\" \"),\" \"))","v":65.000005000000002},{"$f":"IF(AW11=\" \",\" \",IF(Input!$G15=\"Girl\",IF(RANK(AW11,($AV11:$BE11),0)<=5,AW11,\" \"),\" \"))","v":46.000045},{"$f":"IF(AX11=\" \",\" \",IF(Input!$G15=\"Girl\",IF(RANK(AX11,($AV11:$BE11),0)<=5,AX11,\" \"),\" \"))","v":36.000084999999999},{"$f":"IF(AY11=\" \",\" \",IF(Input!$G15=\"Girl\",IF(RANK(AY11,($AV11:$BE11),0)<=5,AY11,\" \"),\" \"))","v":24.000125000000001},{"$f":"IF(AZ11=\" \",\" \",IF(Input!$G15=\"Girl\",IF(RANK(AZ11,($AV11:$BE11),0)<=5,AZ11,\" \"),\" \"))","v":25.000164999999999},{"$f":"IF(BA11=\" \",\" \",IF(Input!$G15=\"Girl\",IF(RANK(BA11,($AV11:$BE11),0)<=5,BA11,\" \"),\" \"))","v":" "},{"$f":"IF(BB11=\" \",\" \",IF(Input!$G15=\"Girl\",IF(RANK(BB11,($AV11:$BE11),0)<=5,BB11,\" \"),\" \"))","v":" "},{"$f":"IF(BC11=\" \",\" \",IF(Input!$G15=\"Girl\",IF(RANK(BC11,($AV11:$BE11),0)<=5,BC11,\" \"),\" \"))","v":" "},{"$f":"IF(BD11=\" \",\" \",IF(Input!$G15=\"Girl\",IF(RANK(BD11,($AV11:$BE11),0)<=5,BD11,\" \"),\" \"))","v":" "},{"$f":"IF(BE11=\" \",\" \",IF(Input!$G15=\"Girl\",IF(RANK(BE11,($AV11:$BE11),0)<=5,BE11,\" \"),\" \"))","v":" "},null," "," "," "," "," "," "," "," "," "," ",null,"RED","RED","RED",{"$error":"#N/A"},{"$error":"#N/A"}," "," "," "," "," ",5.0000000000000004E-6,4.5000000000000003E-5,8.5000000000000006E-5,1.25E-4,1.65E-4,2.05E-4,2.4499999999999999E-4,2.8499999999999999E-4,3.2499999999999999E-4,3.6499999999999998E-4," "," "," "," "," "," "," "," "," "," "," ",65.000005000000002,46.000045,36.000084999999999,24.000125000000001,25.000164999999999," "," "," "," "," "]
[null,null,{"$f":"Input!D16","v":"Bradley Cant"},{"$f":"Input!#REF!","v":{"$error":"#REF!"}},{"$f":"Input!E16","v":2},{"$f":"Input!F16","v":7},{"$f":"Input!G16","v":"BOY"},31,26,20,18,0,20,0,0,0,0,0,0,115,"Step 6"," "," ",115,"115-BOY-2",{"$f":"Input!D16","v":"Bradley Cant"},{"$f":"IF(Input!E16=0,0,IF(ISNA(VLOOKUP((CONCATENATE(\"Balance Test-\",Input!H16)),points1,2,)),0,(VLOOKUP((CONCATENATE(\"Balance Test-\",Input!H16)),points1,2,))))","v":31},{"$f":"IF(Input!E16=0,0,IF(ISNA(VLOOKUP((CONCATENATE(\"Standing Long Jump-\",Input!I16)),points1,2,)),0,(VLOOKUP((CONCATENATE(\"Standing Long Jump-\",Input!I16)),points1,2,))))","v":26},{"$f":"IF(Input!E16=0,0,IF(ISNA(VLOOKUP((CONCATENATE(\"Speed Bounce-\",Input!J16)),points1,2,)),0,(VLOOKUP((CONCATENATE(\"Speed Bounce-\",Input!J16)),points1,2,))))","v":20},{"$f":"IF(Input!E16=0,0,IF(ISNA(VLOOKUP((CONCATENATE(\"Target Throw-\",Input!K16)),points1,2,)),0,(VLOOKUP((CONCATENATE(\"Target Throw-\",Input!K16)),points1,2,))))","v":18},{"$f":"IF(Input!E16=0,0,IF(Input!$C16>6,IF(ISNA(VLOOKUP((CONCATENATE(\"Overhead Heave-\",Input!L16)),points1,2,)),0,(VLOOKUP((CONCATENATE(\"Overhead Heave-\",Input!L16)),points1,2,))),0))","v":0},18,{"$f":"IF(Input!E16=0,0,IF(ISNA(VLOOKUP((CONCATENATE(\"Hi-Stepper-\",Input!M16)),points1,2,)),0,(VLOOKUP((CONCATENATE(\"Hi-Stepper-\",Input!M16)),points1,2,))))","v":20},{"$f":"IF(Input!E16=0,0,IF(ISNA(VLOOKUP((CONCATENATE(\"Chest Push-\",Input!N16)),points1,2,)),0,(VLOOKUP((CONCATENATE(\"Chest Push-\",Input!N16)),points1,2,))))","v":0},{"$f":"IF(Input!E16=0,0,IF(ISNA(VLOOKUP((CONCATENATE(\"Vertical Jump-\",Input!O16)),points1,2,)),0,(VLOOKUP((CONCATENATE(\"Vertical Jump-\",Input!O16)),points1,2,))))","v":0},{"$f":"IF(Input!E16=0,0,IF(ISNA(VLOOKUP((CONCATENATE(\"Shuttle Run-\",Input!P16)),points1,2,)),0,(VLOOKUP((CONCATENATE(\"Shuttle Run-\",Input!P16)),points1,2,))))","v":0},{"$f":"IF(Input!E16=0,0,IF(ISNA(VLOOKUP((CONCATENATE(\"Javelin Throw-\",Input!Q16)),points1,2,)),0,(VLOOKUP((CONCATENATE(\"Javelin Throw-\",Input!Q16)),points1,2,))))","v":0},{"$f":"IF(Input!E16=0,0,IF(Input!$C16>6,IF(ISNA(VLOOKUP((CONCATENATE(\"Shot-\",Input!R16)),points1,2,)),0,(VLOOKUP((CONCATENATE(\"Shot-\",Input!R16)),points1,2,))),0))","v":0},0,{"$f":"IF(Input!E16=0,0,IF(ISNA(VLOOKUP((CONCATENATE(\"Standing Triple Jump-\",Input!S16)),points1,2,)),0,(VLOOKUP((CONCATENATE(\"Standing Triple Jump-\",Input!S16)),points1,2,))))","v":0},{"$f":"IF(Input!$C16>6,COUNT(Input!H16:J16,Input!M16:P16,Input!S16,Input!X16:Y16),IF(Input!$C16<=6,COUNT(Input!H16:K16,Input!M16:Q16,Input!S16)))","v":5},{"$f":"IF(AO12>=5,(LARGE((AA12:AC12,AF12:AJ12,AM12:AN12),1))+LARGE((AA12:AC12,AF12:AJ12,AM12:AN12),2)+LARGE((AA12:AC12,AF12:AJ12,AM12:AN12),3)+LARGE((AA12:AC12,AF12:AJ12,AM12:AN12),4)+LARGE((AA12:AC12,AF12:AJ12,AM12:AN12),5),0)","v":115},{"$f":"IF(AP12=0,0,IF((Input!G16=\"Boy\")*AND(Input!C16>6),VLOOKUP(AP12,award2,3),IF((Input!G16=\"Girl\")*AND(Input!C16>6),VLOOKUP(AP12,award2,2),IF((Input!G16=\"Boy\")*AND(Input!C16<=6),VLOOKUP(AP12,award12,3),IF((Input!G16=\"Girl\")*AND(Input!C16<=6),VLOOKUP(AP12,award12,2),0)))))","v":"Step 6"},{"$f":"IF(Input!$C16>6,COUNT(Input!H16:J16,Input!M16:P16,Input!S16,Input!X16:Y16),IF(Input!$C16<=6,COUNT(Input!H16:K16,Input!M16:Q16,Input!S16)))","v":5},0,{"$f":"IF(AS12=0,0,IF((Input!G16=\"Boy\")*AND(Input!C16>6),VLOOKUP(AS12,award2,5),IF((Input!G16=\"Girl\")*AND(Input!C16>6),VLOOKUP(AS12,award2,4),IF((Input!G16=\"Boy\")*AND(Input!C16<=6),VLOOKUP(AS12,award12,5),IF((Input!G16=\"Girl\")*AND(Input!C16<=6),VLOOKUP(AS12,award12,4),0)))))","v":0},null,31.000005999999999,26.000046000000001,20.000086,18.000126000000002,20.000166," "," "," "," "," ",null,{"$f":"IF(AV12=\" \",\" \",IF(Input!$G16=\"Boy\",IF(RANK(AV12,($AV12:$BE12),0)<=5,AV12,\" \"),\" \"))","v":31.000005999999999},{"$f":"IF(AW12=\" \",\" \",IF(Input!$G16=\"Boy\",IF(RANK(AW12,($AV12:$BE12),0)<=5,AW12,\" \"),\" \"))","v":26.000046000000001},{"$f":"IF(AX12=\" \",\" \",IF(Input!$G16=\"Boy\",IF(RANK(AX12,($AV12:$BE12),0)<=5,AX12,\" \"),\" \"))","v":20.000086},{"$f":"IF(AY12=\" \",\" \",IF(Input!$G16=\"Boy\",IF(RANK(AY12,($AV12:$BE12),0)<=5,AY12,\" \"),\" \"))","v":18.000126000000002},{"$f":"IF(AZ12=\" \",\" \",IF(Input!$G16=\"Boy\",IF(RANK(AZ12,($AV12:$BE12),0)<=5,AZ12,\" \"),\" \"))","v":20.000166},{"$f":"IF(BA12=\" \",\" \",IF(Input!$G16=\"Boy\",IF(RANK(BA12,($AV12:$BE12),0)<=5,BA12,\" \"),\" \"))","v":" "},{"$f":"IF(BB12=\" \",\" \",IF(Input!$G16=\"Boy\",IF(RANK(BB12,($AV12:$BE12),0)<=5,BB12,\" \"),\" \"))","v":" "},{"$f":"IF(BC12=\" \",\" \",IF(Input!$G16=\"Boy\",IF(RANK(BC12,($AV12:$BE12),0)<=5,BC12,\" \"),\" \"))","v":" "},{"$f":"IF(BD12=\" \",\" \",IF(Input!$G16=\"Boy\",IF(RANK(BD12,($AV12:$BE12),0)<=5,BD12,\" \"),\" \"))","v":" "},{"$f":"IF(BE12=\" \",\" \",IF(Input!$G16=\"Boy\",IF(RANK(BE12,($AV12:$BE12),0)<=5,BE12,\" \"),\" \"))","v":" "},null,{"$f":"IF(AV12=\" \",\" \",IF(Input!$G16=\"Girl\",IF(RANK(AV12,($AV12:$BE12),0)<=5,AV12,\" \"),\" \"))","v":" "},{"$f":"IF(AW12=\" \",\" \",IF(Input!$G16=\"Girl\",IF(RANK(AW12,($AV12:$BE12),0)<=5,AW12,\" \"),\" \"))","v":" "},{"$f":"IF(AX12=\" \",\" \",IF(Input!$G16=\"Girl\",IF(RANK(AX12,($AV12:$BE12),0)<=5,AX12,\" \"),\" \"))","v":" "},{"$f":"IF(AY12=\" \",\" \",IF(Input!$G16=\"Girl\",IF(RANK(AY12,($AV12:$BE12),0)<=5,AY12,\" \"),\" \"))","v":" "},{"$f":"IF(AZ12=\" \",\" \",IF(Input!$G16=\"Girl\",IF(RANK(AZ12,($AV12:$BE12),0)<=5,AZ12,\" \"),\" \"))","v":" "},{"$f":"IF(BA12=\" \",\" \",IF(Input!$G16=\"Girl\",IF(RANK(BA12,($AV12:$BE12),0)<=5,BA12,\" \"),\" \"))","v":" "},{"$f":"IF(BB12=\" \",\" \",IF(Input!$G16=\"Girl\",IF(RANK(BB12,($AV12:$BE12),0)<=5,BB12,\" \"),\" \"))","v":" "},{"$f":"IF(BC12=\" \",\" \",IF(Input!$G16=\"Girl\",IF(RANK(BC12,($AV12:$BE12),0)<=5,BC12,\" \"),\" \"))","v":" "},{"$f":"IF(BD12=\" \",\" \",IF(Input!$G16=\"Girl\",IF(RANK(BD12,($AV12:$BE12),0)<=5,BD12,\" \"),\" \"))","v":" "},{"$f":"IF(BE12=\" \",\" \",IF(Input!$G16=\"Girl\",IF(RANK(BE12,($AV12:$BE12),0)<=5,BE12,\" \"),\" \"))","v":" "},null,{"$error":"#N/A"},{"$error":"#N/A"},{"$error":"#N/A"},{"$error":"#N/A"},{"$error":"#N/A"}," "," "," "," "," ",null," "," "," "," "," "," "," "," "," "," ",6.0000000000000002E-6,4.6E-5,8.6000000000000003E-5,1.26E-4,1.66E-4,2.0599999999999999E-4,2.4600000000000002E-4,2.8600000000000001E-4,3.2600000000000001E-4,3.6600000000000001E-4,31.000005999999999,26.000046000000001,20.000086,18.000126000000002,20.000166," "," "," "," "," "," "," "," "," "," "," "," "," "," "," "," "]
[null,null,{"$f":"Input!D17","v":"Thaila Jade-Mason"},{"$f":"Input!#REF!","v":{"$error":"#REF!"}},{"$f":"Input!E17","v":5},{"$f":"Input!F17","v":10},{"$f":"Input!G17","v":"GIRL"},56,50,30,33,0,30,0,0,0,0,0,0,199,"Bronze"," "," ",199,"199-GIRL-5",{"$f":"Input!D17","v":"Thaila Jade-Mason"},{"$f":"IF(Input!E17=0,0,IF(ISNA(VLOOKUP((CONCATENATE(\"Balance Test-\",Input!H17)),points1,2,)),0,(VLOOKUP((CONCATENATE(\"Balance Test-\",Input!H17)),points1,2,))))","v":56},{"$f":"IF(Input!E17=0,0,IF(ISNA(VLOOKUP((CONCATENATE(\"Standing Long Jump-\",Input!I17)),points1,2,)),0,(VLOOKUP((CONCATENATE(\"Standing Long Jump-\",Input!I17)),points1,2,))))","v":50},{"$f":"IF(Input!E17=0,0,IF(ISNA(VLOOKUP((CONCATENATE(\"Speed Bounce-\",Input!J17)),points1,2,)),0,(VLOOKUP((CONCATENATE(\"Speed Bounce-\",Input!J17)),points1,2,))))","v":30},{"$f":"IF(Input!E17=0,0,IF(ISNA(VLOOKUP((CONCATENATE(\"Target Throw-\",Input!K17)),points1,2,)),0,(VLOOKUP((CONCATENATE(\"Target Throw-\",Input!K17)),points1,2,))))","v":33},{"$f":"IF(Input!E17=0,0,IF(Input!$C17>6,IF(ISNA(VLOOKUP((CONCATENATE(\"Overhead Heave-\",Input!L17)),points1,2,)),0,(VLOOKUP((CONCATENATE(\"Overhead Heave-\",Input!L17)),points1,2,))),0))","v":0},33,{"$f":"IF(Input!E17=0,0,IF(ISNA(VLOOKUP((CONCATENATE(\"Hi-Stepper-\",Input!M17)),points1,2,)),0,(VLOOKUP((CONCATENATE(\"Hi-Stepper-\",Input!M17)),points1,2,))))","v":30},{"$f":"IF(Input!E17=0,0,IF(ISNA(VLOOKUP((CONCATENATE(\"Chest Push-\",Input!N17)),points1,2,)),0,(VLOOKUP((CONCATENATE(\"Chest Push-\",Input!N17)),points1,2,))))","v":0},{"$f":"IF(Input!E17=0,0,IF(ISNA(VLOOKUP((CONCATENATE(\"Vertical Jump-\",Input!O17)),points1,2,)),0,(VLOOKUP((CONCATENATE(\"Vertical Jump-\",Input!O17)),points1,2,))))","v":0},{"$f":"IF(Input!E17=0,0,IF(ISNA(VLOOKUP((CONCATENATE(\"Shuttle Run-\",Input!P17)),points1,2,)),0,(VLOOKUP((CONCATENATE(\"Shuttle Run-\",Input!P17)),points1,2,))))","v":0},{"$f":"IF(Input!E17=0,0,IF(ISNA(VLOOKUP((CONCATENATE(\"Javelin Throw-\",Input!Q17)),points1,2,)),0,(VLOOKUP((CONCATENATE(\"Javelin Throw-\",Input!Q17)),points1,2,))))","v":0},{"$f":"IF(Input!E17=0,0,IF(Input!$C17>6,IF(ISNA(VLOOKUP((CONCATENATE(\"Shot-\",Input!R17)),points1,2,)),0,(VLOOKUP((CONCATENATE(\"Shot-\",Input!R17)),points1,2,))),0))","v":0},0,{"$f":"IF(Input!E17=0,0,IF(ISNA(VLOOKUP((CONCATENATE(\"Standing Triple Jump-\",Input!S17)),points1,2,)),0,(VLOOKUP((CONCATENATE(\"Standing Triple Jump-\",Input!S17)),points1,2,))))","v":0},{"$f":"IF(Input!$C17>6,COUNT(Input!H17:J17,Input!M17:P17,Input!S17,Input!X17:Y17),IF(Input!$C17<=6,COUNT(Input!H17:K17,Input!M17:Q17,Input!S17)))","v":5},{"$f":"IF(AO13>=5,(LARGE((AA13:AC13,AF13:AJ13,AM13:AN13),1))+LARGE((AA13:AC13,AF13:AJ13,AM13:AN13),2)+LARGE((AA13:AC13,AF13:AJ13,AM13:AN13),3)+LARGE((AA13:AC13,AF13:AJ13,AM13:AN13),4)+LARGE((AA13:AC13,AF13:AJ13,AM13:AN13),5),0)","v":199},{"$f":"IF(AP13=0,0,IF((Input!G17=\"Boy\")*AND(Input!C17>6),VLOOKUP(AP13,award2,3),IF((Input!G17=\"Girl\")*AND(Input!C17>6),VLOOKUP(AP13,award2,2),IF((Input!G17=\"Boy\")*AND(Input!C17<=6),VLOOKUP(AP13,award12,3),IF((Input!G17=\"Girl\")*AND(Input!C17<=6),VLOOKUP(AP13,award12,2),0)))))","v":"Bronze"},{"$f":"IF(Input!$C17>6,COUNT(Input!H17:J17,Input!M17:P17,Input!S17,Input!X17:Y17),IF(Input!$C17<=6,COUNT(Input!H17:K17,Input!M17:Q17,Input!S17)))","v":5},0,{"$f":"IF(AS13=0,0,IF((Input!G17=\"Boy\")*AND(Input!C17>6),VLOOKUP(AS13,award2,5),IF((Input!G17=\"Girl\")*AND(Input!C17>6),VLOOKUP(AS13,award2,4),IF((Input!G17=\"Boy\")*AND(Input!C17<=6),VLOOKUP(AS13,award12,5),IF((Input!G17=\"Girl\")*AND(Input!C17<=6),VLOOKUP(AS13,award12,4),0)))))","v":0},null,56.000006999999997,50.000047000000002,30.000087000000001,33.000126999999999,30.000167000000001," "," "," "," "," ",null,{"$f":"IF(AV13=\" \",\" \",IF(Input!$G17=\"Boy\",IF(RANK(AV13,($AV13:$BE13),0)<=5,AV13,\" \"),\" \"))","v":" "},{"$f":"IF(AW13=\" \",\" \",IF(Input!$G17=\"Boy\",IF(RANK(AW13,($AV13:$BE13),0)<=5,AW13,\" \"),\" \"))","v":" "},{"$f":"IF(AX13=\" \",\" \",IF(Input!$G17=\"Boy\",IF(RANK(AX13,($AV13:$BE13),0)<=5,AX13,\" \"),\" \"))","v":" "},{"$f":"IF(AY13=\" \",\" \",IF(Input!$G17=\"Boy\",IF(RANK(AY13,($AV13:$BE13),0)<=5,AY13,\" \"),\" \"))","v":" "},{"$f":"IF(AZ13=\" \",\" \",IF(Input!$G17=\"Boy\",IF(RANK(AZ13,($AV13:$BE13),0)<=5,AZ13,\" \"),\" \"))","v":" "},{"$f":"IF(BA13=\" \",\" \",IF(Input!$G17=\"Boy\",IF(RANK(BA13,($AV13:$BE13),0)<=5,BA13,\" \"),\" \"))","v":" "},{"$f":"IF(BB13=\" \",\" \",IF(Input!$G17=\"Boy\",IF(RANK(BB13,($AV13:$BE13),0)<=5,BB13,\" \"),\" \"))","v":" "},{"$f":"IF(BC13=\" \",\" \",IF(Input!$G17=\"Boy\",IF(RANK(BC13,($AV13:$BE13),0)<=5,BC13,\" \"),\" \"))","v":" "},{"$f":"IF(BD13=\" \",\" \",IF(Input!$G17=\"Boy\",IF(RANK(BD13,($AV13:$BE13),0)<=5,BD13,\" \"),\" \"))","v":" "},{"$f":"IF(BE13=\" \",\" \",IF(Input!$G17=\"Boy\",IF(RANK(BE13,($AV13:$BE13),0)<=5,BE13,\" \"),\" \"))","v":" "},null,{"$f":"IF(AV13=\" \",\" \",IF(Input!$G17=\"Girl\",IF(RANK(AV13,($AV13:$BE13),0)<=5,AV13,\" \"),\" \"))","v":56.000006999999997},{"$f":"IF(AW13=\" \",\" \",IF(Input!$G17=\"Girl\",IF(RANK(AW13,($AV13:$BE13),0)<=5,AW13,\" \"),\" \"))","v":50.000047000000002},{"$f":"IF(AX13=\" \",\" \",IF(Input!$G17=\"Girl\",IF(RANK(AX13,($AV13:$BE13),0)<=5,AX13,\" \"),\" \"))","v":30.000087000000001},{"$f":"IF(AY13=\" \",\" \",IF(Input!$G17=\"Girl\",IF(RANK(AY13,($AV13:$BE13),0)<=5,AY13,\" \"),\" \"))","v":33.000126999999999},{"$f":"IF(AZ13=\" \",\" \",IF(Input!$G17=\"Girl\",IF(RANK(AZ13,($AV13:$BE13),0)<=5,AZ13,\" \"),\" \"))","v":30.000167000000001},{"$f":"IF(BA13=\" \",\" \",IF(Input!$G17=\"Girl\",IF(RANK(BA13,($AV13:$BE13),0)<=5,BA13,\" \"),\" \"))","v":" "},{"$f":"IF(BB13=\" \",\" \",IF(Input!$G17=\"Girl\",IF(RANK(BB13,($AV13:$BE13),0)<=5,BB13,\" \"),\" \"))","v":" "},{"$f":"IF(BC13=\" \",\" \",IF(Input!$G17=\"Girl\",IF(RANK(BC13,($AV13:$BE13),0)<=5,BC13,\" \"),\" \"))","v":" "},{"$f":"IF(BD13=\" \",\" \",IF(Input!$G17=\"Girl\",IF(RANK(BD13,($AV13:$BE13),0)<=5,BD13,\" \"),\" \"))","v":" "},{"$f":"IF(BE13=\" \",\" \",IF(Input!$G17=\"Girl\",IF(RANK(BE13,($AV13:$BE13),0)<=5,BE13,\" \"),\" \"))","v":" "},null," "," "," "," "," "," "," "," "," "," ",null,{"$error":"#N/A"},"RED",{"$error":"#N/A"},"RED"," "," "," "," "," "," ",6.9999999999999999E-6,4.6999999999999997E-5,8.7000000000000001E-5,1.27E-4,1.6699999999999999E-4,2.0699999999999999E-4,2.4699999999999999E-4,2.8699999999999998E-4,3.2699999999999998E-4,3.6699999999999998E-4," "," "," "," "," "," "," "," "," "," "," ",56.000006999999997,50.000047000000002,30.000087000000001,33.000126999999999,30.000167000000001," "," "," "," "," "]
[null,null,{"$f":"Input!D18","v":"Grace Smith"},{"$f":"Input!#REF!","v":{"$error":"#REF!"}},{"$f":"Input!E18","v":5},{"$f":"Input!F18","v":9},{"$f":"Input!G18","v":"GIRL"},64,40,32,39,0,22,0,0,0,0,0,0,197,"Bronze"," "," ",197,"197-GIRL-5",{"$f":"Input!D18","v":"Grace Smith"},{"$f":"IF(Input!E18=0,0,IF(ISNA(VLOOKUP((CONCATENATE(\"Balance Test-\",Input!H18)),points1,2,)),0,(VLOOKUP((CONCATENATE(\"Balance Test-\",Input!H18)),points1,2,))))","v":64},{"$f":"IF(Input!E18=0,0,IF(ISNA(VLOOKUP((CONCATENATE(\"Standing Long Jump-\",Input!I18)),points1,2,)),0,(VLOOKUP((CONCATENATE(\"Standing Long Jump-\",Input!I18)),points1,2,))))","v":40},{"$f":"IF(Input!E18=0,0,IF(ISNA(VLOOKUP((CONCATENATE(\"Speed Bounce-\",Input!J18)),points1,2,)),0,(VLOOKUP((CONCATENATE(\"Speed Bounce-\",Input!J18)),points1,2,))))","v":32},{"$f":"IF(Input!E18=0,0,IF(ISNA(VLOOKUP((CONCATENATE(\"Target Throw-\",Input!K18)),points1,2,)),0,(VLOOKUP((CONCATENATE(\"Target Throw-\",Input!K18)),points1,2,))))","v":39},{"$f":"IF(Input!E18=0,0,IF(Input!$C18>6,IF(ISNA(VLOOKUP((CONCATENATE(\"Overhead Heave-\",Input!L18)),points1,2,)),0,(VLOOKUP((CONCATENATE(\"Overhead Heave-\",Input!L18)),points1,2,))),0))","v":0},39,{"$f":"IF(Input!E18=0,0,IF(ISNA(VLOOKUP((CONCATENATE(\"Hi-Stepper-\",Input!M18)),points1,2,)),0,(VLOOKUP((CONCATENATE(\"Hi-Stepper-\",Input!M18)),points1,2,))))","v":22},{"$f":"IF(Input!E18=0,0,IF(ISNA(VLOOKUP((CONCATENATE(\"Chest Push-\",Input!N18)),points1,2,)),0,(VLOOKUP((CONCATENATE(\"Chest Push-\",Input!N18)),points1,2,))))","v":0},{"$f":"IF(Input!E18=0,0,IF(ISNA(VLOOKUP((CONCATENATE(\"Vertical Jump-\",Input!O18)),points1,2,)),0,(VLOOKUP((CONCATENATE(\"Vertical Jump-\",Input!O18)),points1,2,))))","v":0},{"$f":"IF(Input!E18=0,0,IF(ISNA(VLOOKUP((CONCATENATE(\"Shuttle Run-\",Input!P18)),points1,2,)),0,(VLOOKUP((CONCATENATE(\"Shuttle Run-\",Input!P18)),points1,2,))))","v":0},{"$f":"IF(Input!E18=0,0,IF(ISNA(VLOOKUP((CONCATENATE(\"Javelin Throw-\",Input!Q18)),points1,2,)),0,(VLOOKUP((CONCATENATE(\"Javelin Throw-\",Input!Q18)),points1,2,))))","v":0},{"$f":"IF(Input!E18=0,0,IF(Input!$C18>6,IF(ISNA(VLOOKUP((CONCATENATE(\"Shot-\",Input!R18)),points1,2,)),0,(VLOOKUP((CONCATENATE(\"Shot-\",Input!R18)),points1,2,))),0))","v":0},0,{"$f":"IF(Input!E18=0,0,IF(ISNA(VLOOKUP((CONCATENATE(\"Standing Triple Jump-\",Input!S18)),points1,2,)),0,(VLOOKUP((CONCATENATE(\"Standing Triple Jump-\",Input!S18)),points1,2,))))","v":0},{"$f":"IF(Input!$C18>6,COUNT(Input!H18:J18,Input!M18:P18,Input!S18,Input!X18:Y18),IF(Input!$C18<=6,COUNT(Input!H18:K18,Input!M18:Q18,Input!S18)))","v":5},{"$f":"IF(AO14>=5,(LARGE((AA14:AC14,AF14:AJ14,AM14:AN14),1))+LARGE((AA14:AC14,AF14:AJ14,AM14:AN14),2)+LARGE((AA14:AC14,AF14:AJ14,AM14:AN14),3)+LARGE((AA14:AC14,AF14:AJ14,AM14:AN14),4)+LARGE((AA14:AC14,AF14:AJ14,AM14:AN14),5),0)","v":197},{"$f":"IF(AP14=0,0,IF((Input!G18=\"Boy\")*AND(Input!C18>6),VLOOKUP(AP14,award2,3),IF((Input!G18=\"Girl\")*AND(Input!C18>6),VLOOKUP(AP14,award2,2),IF((Input!G18=\"Boy\")*AND(Input!C18<=6),VLOOKUP(AP14,award12,3),IF((Input!G18=\"Girl\")*AND(Input!C18<=6),VLOOKUP(AP14,award12,2),0)))))","v":"Bronze"},{"$f":"IF(Input!$C18>6,COUNT(Input!H18:J18,Input!M18:P18,Input!S18,Input!X18:Y18),IF(Input!$C18<=6,COUNT(Input!H18:K18,Input!M18:Q18,Input!S18)))","v":5},0,{"$f":"IF(AS14=0,0,IF((Input!G18=\"Boy\")*AND(Input!C18>6),VLOOKUP(AS14,award2,5),IF((Input!G18=\"Girl\")*AND(Input!C18>6),VLOOKUP(AS14,award2,4),IF((Input!G18=\"Boy\")*AND(Input!C18<=6),VLOOKUP(AS14,award12,5),IF((Input!G18=\"Girl\")*AND(Input!C18<=6),VLOOKUP(AS14,award12,4),0)))))","v":0},null,64.000007999999994,40.000048,32.000087999999998,39.000127999999997,22.000167999999999," "," "," "," "," ",null,{"$f":"IF(AV14=\" \",\" \",IF(Input!$G18=\"Boy\",IF(RANK(AV14,($AV14:$BE14),0)<=5,AV14,\" \"),\" \"))","v":" "},{"$f":"IF(AW14=\" \",\" \",IF(Input!$G18=\"Boy\",IF(RANK(AW14,($AV14:$BE14),0)<=5,AW14,\" \"),\" \"))","v":" "},{"$f":"IF(AX14=\" \",\" \",IF(Input!$G18=\"Boy\",IF(RANK(AX14,($AV14:$BE14),0)<=5,AX14,\" \"),\" \"))","v":" "},{"$f":"IF(AY14=\" \",\" \",IF(Input!$G18=\"Boy\",IF(RANK(AY14,($AV14:$BE14),0)<=5,AY14,\" \"),\" \"))","v":" "},{"$f":"IF(AZ14=\" \",\" \",IF(Input!$G18=\"Boy\",IF(RANK(AZ14,($AV14:$BE14),0)<=5,AZ14,\" \"),\" \"))","v":" "},{"$f":"IF(BA14=\" \",\" \",IF(Input!$G18=\"Boy\",IF(RANK(BA14,($AV14:$BE14),0)<=5,BA14,\" \"),\" \"))","v":" "},{"$f":"IF(BB14=\" \",\" \",IF(Input!$G18=\"Boy\",IF(RANK(BB14,($AV14:$BE14),0)<=5,BB14,\" \"),\" \"))","v":" "},{"$f":"IF(BC14=\" \",\" \",IF(Input!$G18=\"Boy\",IF(RANK(BC14,($AV14:$BE14),0)<=5,BC14,\" \"),\" \"))","v":" "},{"$f":"IF(BD14=\" \",\" \",IF(Input!$G18=\"Boy\",IF(RANK(BD14,($AV14:$BE14),0)<=5,BD14,\" \"),\" \"))","v":" "},{"$f":"IF(BE14=\" \",\" \",IF(Input!$G18=\"Boy\",IF(RANK(BE14,($AV14:$BE14),0)<=5,BE14,\" \"),\" \"))","v":" "},null,{"$f":"IF(AV14=\" \",\" \",IF(Input!$G18=\"Girl\",IF(RANK(AV14,($AV14:$BE14),0)<=5,AV14,\" \"),\" \"))","v":64.000007999999994},{"$f":"IF(AW14=\" \",\" \",IF(Input!$G18=\"Girl\",IF(RANK(AW14,($AV14:$BE14),0)<=5,AW14,\" \"),\" \"))","v":40.000048},{"$f":"IF(AX14=\" \",\" \",IF(Input!$G18=\"Girl\",IF(RANK(AX14,($AV14:$BE14),0)<=5,AX14,\" \"),\" \"))","v":32.000087999999998},{"$f":"IF(AY14=\" \",\" \",IF(Input!$G18=\"Girl\",IF(RANK(AY14,($AV14:$BE14),0)<=5,AY14,\" \"),\" \"))","v":39.000127999999997},{"$f":"IF(AZ14=\" \",\" \",IF(Input!$G18=\"Girl\",IF(RANK(AZ14,($AV14:$BE14),0)<=5,AZ14,\" \"),\" \"))","v":22.000167999999999},{"$f":"IF(BA14=\" \",\" \",IF(Input!$G18=\"Girl\",IF(RANK(BA14,($AV14:$BE14),0)<=5,BA14,\" \"),\" \"))","v":" "},{"$f":"IF(BB14=\" \",\" \",IF(Input!$G18=\"Girl\",IF(RANK(BB14,($AV14:$BE14),0)<=5,BB14,\" \"),\" \"))","v":" "},{"$f":"IF(BC14=\" \",\" \",IF(Input!$G18=\"Girl\",IF(RANK(BC14,($AV14:$BE14),0)<=5,BC14,\" \"),\" \"))","v":" "},{"$f":"IF(BD14=\" \",\" \",IF(Input!$G18=\"Girl\",IF(RANK(BD14,($AV14:$BE14),0)<=5,BD14,\" \"),\" \"))","v":" "},{"$f":"IF(BE14=\" \",\" \",IF(Input!$G18=\"Girl\",IF(RANK(BE14,($AV14:$BE14),0)<=5,BE14,\" \"),\" \"))","v":" "},null," "," "," "," "," "," "," "," "," "," ",null,"RED",{"$error":"#N/A"},"RED","RED",{"$error":"#N/A"}," "," "," "," "," ",7.9999999999999996E-6,4.8000000000000001E-5,8.7999999999999998E-5,1.2799999999999999E-4,1.6799999999999999E-4,2.0799999999999999E-4,2.4800000000000001E-4,2.8800000000000001E-4,3.28E-4,3.68E-4," "," "," "," "," "," "," "," "," "," "," ",64.000007999999994,40.000048,32.000087999999998,39.000127999999997,22.000167999999999," "," "," "," "," "]
[null,null,{"$f":"Input!D19","v":"Logan Dewar"},{"$f":"Input!#REF!","v":{"$error":"#REF!"}},{"$f":"Input!E19","v":6},{"$f":"Input!F19","v":10},{"$f":"Input!G19","v":"BOY"},42,26,31,57,0,38,0,0,0,0,0,0,194,"Bronze"," "," ",194,"194-BOY-6",{"$f":"Input!D19","v":"Logan Dewar"},{"$f":"IF(Input!E19=0,0,IF(ISNA(VLOOKUP((CONCATENATE(\"Balance Test-\",Input!H19)),points1,2,)),0,(VLOOKUP((CONCATENATE(\"Balance Test-\",Input!H19)),points1,2,))))","v":42},{"$f":"IF(Input!E19=0,0,IF(ISNA(VLOOKUP((CONCATENATE(\"Standing Long Jump-\",Input!I19)),points1,2,)),0,(VLOOKUP((CONCATENATE(\"Standing Long Jump-\",Input!I19)),points1,2,))))","v":26},{"$f":"IF(Input!E19=0,0,IF(ISNA(VLOOKUP((CONCATENATE(\"Speed Bounce-\",Input!J19)),points1,2,)),0,(VLOOKUP((CONCATENATE(\"Speed Bounce-\",Input!J19)),points1,2,))))","v":31},{"$f":"IF(Input!E19=0,0,IF(ISNA(VLOOKUP((CONCATENATE(\"Target Throw-\",Input!K19)),points1,2,)),0,(VLOOKUP((CONCATENATE(\"Target Throw-\",Input!K19)),points1,2,))))","v":57},{"$f":"IF(Input!E19=0,0,IF(Input!$C19>6,IF(ISNA(VLOOKUP((CONCATENATE(\"Overhead Heave-\",Input!L19)),points1,2,)),0,(VLOOKUP((CONCATENATE(\"Overhead Heave-\",Input!L19)),points1,2,))),0))","v":0},57,{"$f":"IF(Input!E19=0,0,IF(ISNA(VLOOKUP((CONCATENATE(\"Hi-Stepper-\",Input!M19)),points1,2,)),0,(VLOOKUP((CONCATENATE(\"Hi-Stepper-\",Input!M19)),points1,2,))))","v":38},{"$f":"IF(Input!E19=0,0,IF(ISNA(VLOOKUP((CONCATENATE(\"Chest Push-\",Input!N19)),points1,2,)),0,(VLOOKUP((CONCATENATE(\"Chest Push-\",Input!N19)),points1,2,))))","v":0},{"$f":"IF(Input!E19=0,0,IF(ISNA(VLOOKUP((CONCATENATE(\"Vertical Jump-\",Input!O19)),points1,2,)),0,(VLOOKUP((CONCATENATE(\"Vertical Jump-\",Input!O19)),points1,2,))))","v":0},{"$f":"IF(Input!E19=0,0,IF(ISNA(VLOOKUP((CONCATENATE(\"Shuttle Run-\",Input!P19)),points1,2,)),0,(VLOOKUP((CONCATENATE(\"Shuttle Run-\",Input!P19)),points1,2,))))","v":0},{"$f":"IF(Input!E19=0,0,IF(ISNA(VLOOKUP((CONCATENATE(\"Javelin Throw-\",Input!Q19)),points1,2,)),0,(VLOOKUP((CONCATENATE(\"Javelin Throw-\",Input!Q19)),points1,2,))))","v":0},{"$f":"IF(Input!E19=0,0,IF(Input!$C19>6,IF(ISNA(VLOOKUP((CONCATENATE(\"Shot-\",Input!R19)),points1,2,)),0,(VLOOKUP((CONCATENATE(\"Shot-\",Input!R19)),points1,2,))),0))","v":0},0,{"$f":"IF(Input!E19=0,0,IF(ISNA(VLOOKUP((CONCATENATE(\"Standing Triple Jump-\",Input!S19)),points1,2,)),0,(VLOOKUP((CONCATENATE(\"Standing Triple Jump-\",Input!S19)),points1,2,))))","v":0},{"$f":"IF(Input!$C19>6,COUNT(Input!H19:J19,Input!M19:P19,Input!S19,Input!X19:Y19),IF(Input!$C19<=6,COUNT(Input!H19:K19,Input!M19:Q19,Input!S19)))","v":5},{"$f":"IF(AO15>=5,(LARGE((AA15:AC15,AF15:AJ15,AM15:AN15),1))+LARGE((AA15:AC15,AF15:AJ15,AM15:AN15),2)+LARGE((AA15:AC15,AF15:AJ15,AM15:AN15),3)+LARGE((AA15:AC15,AF15:AJ15,AM15:AN15),4)+LARGE((AA15:AC15,AF15:AJ15,AM15:AN15),5),0)","v":194},{"$f":"IF(AP15=0,0,IF((Input!G19=\"Boy\")*AND(Input!C19>6),VLOOKUP(AP15,award2,3),IF((Input!G19=\"Girl\")*AND(Input!C19>6),VLOOKUP(AP15,award2,2),IF((Input!G19=\"Boy\")*AND(Input!C19<=6),VLOOKUP(AP15,award12,3),IF((Input!G19=\"Girl\")*AND(Input!C19<=6),VLOOKUP(AP15,award12,2),0)))))","v":"Bronze"},{"$f":"IF(Input!$C19>6,COUNT(Input!H19:J19,Input!M19:P19,Input!S19,Input!X19:Y19),IF(Input!$C19<=6,COUNT(Input!H19:K19,Input!M19:Q19,Input!S19)))","v":5},0,{"$f":"IF(AS15=0,0,IF((Input!G19=\"Boy\")*AND(Input!C19>6),VLOOKUP(AS15,award2,5),IF((Input!G19=\"Girl\")*AND(Input!C19>6),VLOOKUP(AS15,award2,4),IF((Input!G19=\"Boy\")*AND(Input!C19<=6),VLOOKUP(AS15,award12,5),IF((Input!G19=\"Girl\")*AND(Input!C19<=6),VLOOKUP(AS15,award12,4),0)))))","v":0},null,42.000008999999999,26.000049000000001,31.000088999999999,57.000129000000001,38.000169," "," "," "," "," ",null,{"$f":"IF(AV15=\" \",\" \",IF(Input!$G19=\"Boy\",IF(RANK(AV15,($AV15:$BE15),0)<=5,AV15,\" \"),\" \"))","v":42.000008999999999},{"$f":"IF(AW15=\" \",\" \",IF(Input!$G19=\"Boy\",IF(RANK(AW15,($AV15:$BE15),0)<=5,AW15,\" \"),\" \"))","v":26.000049000000001},{"$f":"IF(AX15=\" \",\" \",IF(Input!$G19=\"Boy\",IF(RANK(AX15,($AV15:$BE15),0)<=5,AX15,\" \"),\" \"))","v":31.000088999999999},{"$f":"IF(AY15=\" \",\" \",IF(Input!$G19=\"Boy\",IF(RANK(AY15,($AV15:$BE15),0)<=5,AY15,\" \"),\" \"))","v":57.000129000000001},{"$f":"IF(AZ15=\" \",\" \",IF(Input!$G19=\"Boy\",IF(RANK(AZ15,($AV15:$BE15),0)<=5,AZ15,\" \"),\" \"))","v":38.000169},{"$f":"IF(BA15=\" \",\" \",IF(Input!$G19=\"Boy\",IF(RANK(BA15,($AV15:$BE15),0)<=5,BA15,\" \"),\" \"))","v":" "},{"$f":"IF(BB15=\" \",\" \",IF(Input!$G19=\"Boy\",IF(RANK(BB15,($AV15:$BE15),0)<=5,BB15,\" \"),\" \"))","v":" "},{"$f":"IF(BC15=\" \",\" \",IF(Input!$G19=\"Boy\",IF(RANK(BC15,($AV15:$BE15),0)<=5,BC15,\" \"),\" \"))","v":" "},{"$f":"IF(BD15=\" \",\" \",IF(Input!$G19=\"Boy\",IF(RANK(BD15,($AV15:$BE15),0)<=5,BD15,\" \"),\" \"))","v":" "},{"$f":"IF(BE15=\" \",\" \",IF(Input!$G19=\"Boy\",IF(RANK(BE15,($AV15:$BE15),0)<=5,BE15,\" \"),\" \"))","v":" "},null,{"$f":"IF(AV15=\" \",\" \",IF(Input!$G19=\"Girl\",IF(RANK(AV15,($AV15:$BE15),0)<=5,AV15,\" \"),\" \"))","v":" "},{"$f":"IF(AW15=\" \",\" \",IF(Input!$G19=\"Girl\",IF(RANK(AW15,($AV15:$BE15),0)<=5,AW15,\" \"),\" \"))","v":" "},{"$f":"IF(AX15=\" \",\" \",IF(Input!$G19=\"Girl\",IF(RANK(AX15,($AV15:$BE15),0)<=5,AX15,\" \"),\" \"))","v":" "},{"$f":"IF(AY15=\" \",\" \",IF(Input!$G19=\"Girl\",IF(RANK(AY15,($AV15:$BE15),0)<=5,AY15,\" \"),\" \"))","v":" "},{"$f":"IF(AZ15=\" \",\" \",IF(Input!$G19=\"Girl\",IF(RANK(AZ15,($AV15:$BE15),0)<=5,AZ15,\" \"),\" \"))","v":" "},{"$f":"IF(BA15=\" \",\" \",IF(Input!$G19=\"Girl\",IF(RANK(BA15,($AV15:$BE15),0)<=5,BA15,\" \"),\" \"))","v":" "},{"$f":"IF(BB15=\" \",\" \",IF(Input!$G19=\"Girl\",IF(RANK(BB15,($AV15:$BE15),0)<=5,BB15,\" \"),\" \"))","v":" "},{"$f":"IF(BC15=\" \",\" \",IF(Input!$G19=\"Girl\",IF(RANK(BC15,($AV15:$BE15),0)<=5,BC15,\" \"),\" \"))","v":" "},{"$f":"IF(BD15=\" \",\" \",IF(Input!$G19=\"Girl\",IF(RANK(BD15,($AV15:$BE15),0)<=5,BD15,\" \"),\" \"))","v":" "},{"$f":"IF(BE15=\" \",\" \",IF(Input!$G19=\"Girl\",IF(RANK(BE15,($AV15:$BE15),0)<=5,BE15,\" \"),\" \"))","v":" "},null,{"$error":"#N/A"},{"$error":"#N/A"},{"$error":"#N/A"},"RED",{"$error":"#N/A"}," "," "," "," "," ",null," "," "," "," "," "," "," "," "," "," ",9.0000000000000002E-6,4.8999999999999998E-5,8.8999999999999995E-5,1.2899999999999999E-4,1.6899999999999999E-4,2.0900000000000001E-4,2.4899999999999998E-4,2.8899999999999998E-4,3.2899999999999997E-4,3.6900000000000002E-4,42.000008999999999,26.000049000000001,31.000088999999999,57.000129000000001,38.000169," "," "," "," "," "," "," "," "," "," "," "," "," "," "," "," "]
[null,null,{"$f":"Input!D20","v":"Ash Carter"},{"$f":"Input!#REF!","v":{"$error":"#REF!"}},{"$f":"Input!E20","v":6},{"$f":"Input!F20","v":10},{"$f":"Input!G20","v":"BOY"},62,28,34,36,0,52,0,0,0,0,0,0,212,"Bronze"," "," ",212,"212-BOY-6",{"$f":"Input!D20","v":"Ash Carter"},{"$f":"IF(Input!E20=0,0,IF(ISNA(VLOOKUP((CONCATENATE(\"Balance Test-\",Input!H20)),points1,2,)),0,(VLOOKUP((CONCATENATE(\"Balance Test-\",Input!H20)),points1,2,))))","v":62},{"$f":"IF(Input!E20=0,0,IF(ISNA(VLOOKUP((CONCATENATE(\"Standing Long Jump-\",Input!I20)),points1,2,)),0,(VLOOKUP((CONCATENATE(\"Standing Long Jump-\",Input!I20)),points1,2,))))","v":28},{"$f":"IF(Input!E20=0,0,IF(ISNA(VLOOKUP((CONCATENATE(\"Speed Bounce-\",Input!J20)),points1,2,)),0,(VLOOKUP((CONCATENATE(\"Speed Bounce-\",Input!J20)),points1,2,))))","v":34},{"$f":"IF(Input!E20=0,0,IF(ISNA(VLOOKUP((CONCATENATE(\"Target Throw-\",Input!K20)),points1,2,)),0,(VLOOKUP((CONCATENATE(\"Target Throw-\",Input!K20)),points1,2,))))","v":36},{"$f":"IF(Input!E20=0,0,IF(Input!$C20>6,IF(ISNA(VLOOKUP((CONCATENATE(\"Overhead Heave-\",Input!L20)),points1,2,)),0,(VLOOKUP((CONCATENATE(\"Overhead Heave-\",Input!L20)),points1,2,))),0))","v":0},36,{"$f":"IF(Input!E20=0,0,IF(ISNA(VLOOKUP((CONCATENATE(\"Hi-Stepper-\",Input!M20)),points1,2,)),0,(VLOOKUP((CONCATENATE(\"Hi-Stepper-\",Input!M20)),points1,2,))))","v":52},{"$f":"IF(Input!E20=0,0,IF(ISNA(VLOOKUP((CONCATENATE(\"Chest Push-\",Input!N20)),points1,2,)),0,(VLOOKUP((CONCATENATE(\"Chest Push-\",Input!N20)),points1,2,))))","v":0},{"$f":"IF(Input!E20=0,0,IF(ISNA(VLOOKUP((CONCATENATE(\"Vertical Jump-\",Input!O20)),points1,2,)),0,(VLOOKUP((CONCATENATE(\"Vertical Jump-\",Input!O20)),points1,2,))))","v":0},{"$f":"IF(Input!E20=0,0,IF(ISNA(VLOOKUP((CONCATENATE(\"Shuttle Run-\",Input!P20)),points1,2,)),0,(VLOOKUP((CONCATENATE(\"Shuttle Run-\",Input!P20)),points1,2,))))","v":0},{"$f":"IF(Input!E20=0,0,IF(ISNA(VLOOKUP((CONCATENATE(\"Javelin Throw-\",Input!Q20)),points1,2,)),0,(VLOOKUP((CONCATENATE(\"Javelin Throw-\",Input!Q20)),points1,2,))))","v":0},{"$f":"IF(Input!E20=0,0,IF(Input!$C20>6,IF(ISNA(VLOOKUP((CONCATENATE(\"Shot-\",Input!R20)),points1,2,)),0,(VLOOKUP((CONCATENATE(\"Shot-\",Input!R20)),points1,2,))),0))","v":0},0,{"$f":"IF(Input!E20=0,0,IF(ISNA(VLOOKUP((CONCATENATE(\"Standing Triple Jump-\",Input!S20)),points1,2,)),0,(VLOOKUP((CONCATENATE(\"Standing Triple Jump-\",Input!S20)),points1,2,))))","v":0},{"$f":"IF(Input!$C20>6,COUNT(Input!H20:J20,Input!M20:P20,Input!S20,Input!X20:Y20),IF(Input!$C20<=6,COUNT(Input!H20:K20,Input!M20:Q20,Input!S20)))","v":5},{"$f":"IF(AO16>=5,(LARGE((AA16:AC16,AF16:AJ16,AM16:AN16),1))+LARGE((AA16:AC16,AF16:AJ16,AM16:AN16),2)+LARGE((AA16:AC16,AF16:AJ16,AM16:AN16),3)+LARGE((AA16:AC16,AF16:AJ16,AM16:AN16),4)+LARGE((AA16:AC16,AF16:AJ16,AM16:AN16),5),0)","v":212},{"$f":"IF(AP16=0,0,IF((Input!G20=\"Boy\")*AND(Input!C20>6),VLOOKUP(AP16,award2,3),IF((Input!G20=\"Girl\")*AND(Input!C20>6),VLOOKUP(AP16,award2,2),IF((Input!G20=\"Boy\")*AND(Input!C20<=6),VLOOKUP(AP16,award12,3),IF((Input!G20=\"Girl\")*AND(Input!C20<=6),VLOOKUP(AP16,award12,2),0)))))","v":"Bronze"},{"$f":"IF(Input!$C20>6,COUNT(Input!H20:J20,Input!M20:P20,Input!S20,Input!X20:Y20),IF(Input!$C20<=6,COUNT(Input!H20:K20,Input!M20:Q20,Input!S20)))","v":5},0,{"$f":"IF(AS16=0,0,IF((Input!G20=\"Boy\")*AND(Input!C20>6),VLOOKUP(AS16,award2,5),IF((Input!G20=\"Girl\")*AND(Input!C20>6),VLOOKUP(AS16,award2,4),IF((Input!G20=\"Boy\")*AND(Input!C20<=6),VLOOKUP(AS16,award12,5),IF((Input!G20=\"Girl\")*AND(Input!C20<=6),VLOOKUP(AS16,award12,4),0)))))","v":0},null,62.000010000000003,28.000050000000002,34.00009,36.000129999999999,52.000169999999997," "," "," "," "," ",null,{"$f":"IF(AV16=\" \",\" \",IF(Input!$G20=\"Boy\",IF(RANK(AV16,($AV16:$BE16),0)<=5,AV16,\" \"),\" \"))","v":62.000010000000003},{"$f":"IF(AW16=\" \",\" \",IF(Input!$G20=\"Boy\",IF(RANK(AW16,($AV16:$BE16),0)<=5,AW16,\" \"),\" \"))","v":28.000050000000002},{"$f":"IF(AX16=\" \",\" \",IF(Input!$G20=\"Boy\",IF(RANK(AX16,($AV16:$BE16),0)<=5,AX16,\" \"),\" \"))","v":34.00009},{"$f":"IF(AY16=\" \",\" \",IF(Input!$G20=\"Boy\",IF(RANK(AY16,($AV16:$BE16),0)<=5,AY16,\" \"),\" \"))","v":36.000129999999999},{"$f":"IF(AZ16=\" \",\" \",IF(Input!$G20=\"Boy\",IF(RANK(AZ16,($AV16:$BE16),0)<=5,AZ16,\" \"),\" \"))","v":52.000169999999997},{"$f":"IF(BA16=\" \",\" \",IF(Input!$G20=\"Boy\",IF(RANK(BA16,($AV16:$BE16),0)<=5,BA16,\" \"),\" \"))","v":" "},{"$f":"IF(BB16=\" \",\" \",IF(Input!$G20=\"Boy\",IF(RANK(BB16,($AV16:$BE16),0)<=5,BB16,\" \"),\" \"))","v":" "},{"$f":"IF(BC16=\" \",\" \",IF(Input!$G20=\"Boy\",IF(RANK(BC16,($AV16:$BE16),0)<=5,BC16,\" \"),\" \"))","v":" "},{"$f":"IF(BD16=\" \",\" \",IF(Input!$G20=\"Boy\",IF(RANK(BD16,($AV16:$BE16),0)<=5,BD16,\" \"),\" \"))","v":" "},{"$f":"IF(BE16=\" \",\" \",IF(Input!$G20=\"Boy\",IF(RANK(BE16,($AV16:$BE16),0)<=5,BE16,\" \"),\" \"))","v":" "},null,{"$f":"IF(AV16=\" \",\" \",IF(Input!$G20=\"Girl\",IF(RANK(AV16,($AV16:$BE16),0)<=5,AV16,\" \"),\" \"))","v":" "},{"$f":"IF(AW16=\" \",\" \",IF(Input!$G20=\"Girl\",IF(RANK(AW16,($AV16:$BE16),0)<=5,AW16,\" \"),\" \"))","v":" "},{"$f":"IF(AX16=\" \",\" \",IF(Input!$G20=\"Girl\",IF(RANK(AX16,($AV16:$BE16),0)<=5,AX16,\" \"),\" \"))","v":" "},{"$f":"IF(AY16=\" \",\" \",IF(Input!$G20=\"Girl\",IF(RANK(AY16,($AV16:$BE16),0)<=5,AY16,\" \"),\" \"))","v":" "},{"$f":"IF(AZ16=\" \",\" \",IF(Input!$G20=\"Girl\",IF(RANK(AZ16,($AV16:$BE16),0)<=5,AZ16,\" \"),\" \"))","v":" "},{"$f":"IF(BA16=\" \",\" \",IF(Input!$G20=\"Girl\",IF(RANK(BA16,($AV16:$BE16),0)<=5,BA16,\" \"),\" \"))","v":" "},{"$f":"IF(BB16=\" \",\" \",IF(Input!$G20=\"Girl\",IF(RANK(BB16,($AV16:$BE16),0)<=5,BB16,\" \"),\" \"))","v":" "},{"$f":"IF(BC16=\" \",\" \",IF(Input!$G20=\"Girl\",IF(RANK(BC16,($AV16:$BE16),0)<=5,BC16,\" \"),\" \"))","v":" "},{"$f":"IF(BD16=\" \",\" \",IF(Input!$G20=\"Girl\",IF(RANK(BD16,($AV16:$BE16),0)<=5,BD16,\" \"),\" \"))","v":" "},{"$f":"IF(BE16=\" \",\" \",IF(Input!$G20=\"Girl\",IF(RANK(BE16,($AV16:$BE16),0)<=5,BE16,\" \"),\" \"))","v":" "},null,"RED",{"$error":"#N/A"},"RED",{"$error":"#N/A"},"RED"," "," "," "," "," ",null," "," "," "," "," "," "," "," "," "," ",1.0000000000000001E-5,5.0000000000000002E-5,9.0000000000000006E-5,1.2999999999999999E-4,1.7000000000000001E-4,2.1000000000000001E-4,2.5000000000000001E-4,2.9E-4,3.3E-4,3.6999999999999999E-4,62.000010000000003,28.000050000000002,34.00009,36.000129999999999,52.000169999999997," "," "," "," "," "," "," "," "," "," "," "," "," "," "," "," "]
[null,null,{"$f":"Input!D21","v":"Archie Wright"},{"$f":"Input!#REF!","v":{"$error":"#REF!"}},{"$f":"Input!E21","v":6},{"$f":"Input!F21","v":10},{"$f":"Input!G21","v":"BOY"},24,32,28,27,0,28,0,0,0,0,0,0,139,"Step 7"," "," ",139,"139-BOY-6",{"$f":"Input!D21","v":"Archie Wright"},{"$f":"IF(Input!E21=0,0,IF(ISNA(VLOOKUP((CONCATENATE(\"Balance Test-\",Input!H21)),points1,2,)),0,(VLOOKUP((CONCATENATE(\"Balance Test-\",Input!H21)),points1,2,))))","v":24},{"$f":"IF(Input!E21=0,0,IF(ISNA(VLOOKUP((CONCATENATE(\"Standing Long Jump-\",Input!I21)),points1,2,)),0,(VLOOKUP((CONCATENATE(\"Standing Long Jump-\",Input!I21)),points1,2,))))","v":32},{"$f":"IF(Input!E21=0,0,IF(ISNA(VLOOKUP((CONCATENATE(\"Speed Bounce-\",Input!J21)),points1,2,)),0,(VLOOKUP((CONCATENATE(\"Speed Bounce-\",Input!J21)),points1,2,))))","v":28},{"$f":"IF(Input!E21=0,0,IF(ISNA(VLOOKUP((CONCATENATE(\"Target Throw-\",Input!K21)),points1,2,)),0,(VLOOKUP((CONCATENATE(\"Target Throw-\",Input!K21)),points1,2,))))","v":27},{"$f":"IF(Input!E21=0,0,IF(Input!$C21>6,IF(ISNA(VLOOKUP((CONCATENATE(\"Overhead Heave-\",Input!L21)),points1,2,)),0,(VLOOKUP((CONCATENATE(\"Overhead Heave-\",Input!L21)),points1,2,))),0))","v":0},27,{"$f":"IF(Input!E21=0,0,IF(ISNA(VLOOKUP((CONCATENATE(\"Hi-Stepper-\",Input!M21)),points1,2,)),0,(VLOOKUP((CONCATENATE(\"Hi-Stepper-\",Input!M21)),points1,2,))))","v":28},{"$f":"IF(Input!E21=0,0,IF(ISNA(VLOOKUP((CONCATENATE(\"Chest Push-\",Input!N21)),points1,2,)),0,(VLOOKUP((CONCATENATE(\"Chest Push-\",Input!N21)),points1,2,))))","v":0},{"$f":"IF(Input!E21=0,0,IF(ISNA(VLOOKUP((CONCATENATE(\"Vertical Jump-\",Input!O21)),points1,2,)),0,(VLOOKUP((CONCATENATE(\"Vertical Jump-\",Input!O21)),points1,2,))))","v":0},{"$f":"IF(Input!E21=0,0,IF(ISNA(VLOOKUP((CONCATENATE(\"Shuttle Run-\",Input!P21)),points1,2,)),0,(VLOOKUP((CONCATENATE(\"Shuttle Run-\",Input!P21)),points1,2,))))","v":0},{"$f":"IF(Input!E21=0,0,IF(ISNA(VLOOKUP((CONCATENATE(\"Javelin Throw-\",Input!Q21)),points1,2,)),0,(VLOOKUP((CONCATENATE(\"Javelin Throw-\",Input!Q21)),points1,2,))))","v":0},{"$f":"IF(Input!E21=0,0,IF(Input!$C21>6,IF(ISNA(VLOOKUP((CONCATENATE(\"Shot-\",Input!R21)),points1,2,)),0,(VLOOKUP((CONCATENATE(\"Shot-\",Input!R21)),points1,2,))),0))","v":0},0,{"$f":"IF(Input!E21=0,0,IF(ISNA(VLOOKUP((CONCATENATE(\"Standing Triple Jump-\",Input!S21)),points1,2,)),0,(VLOOKUP((CONCATENATE(\"Standing Triple Jump-\",Input!S21)),points1,2,))))","v":0},{"$f":"IF(Input!$C21>6,COUNT(Input!H21:J21,Input!M21:P21,Input!S21,Input!X21:Y21),IF(Input!$C21<=6,COUNT(Input!H21:K21,Input!M21:Q21,Input!S21)))","v":5},{"$f":"IF(AO17>=5,(LARGE((AA17:AC17,AF17:AJ17,AM17:AN17),1))+LARGE((AA17:AC17,AF17:AJ17,AM17:AN17),2)+LARGE((AA17:AC17,AF17:AJ17,AM17:AN17),3)+LARGE((AA17:AC17,AF17:AJ17,AM17:AN17),4)+LARGE((AA17:AC17,AF17:AJ17,AM17:AN17),5),0)","v":139},{"$f":"IF(AP17=0,0,IF((Input!G21=\"Boy\")*AND(Input!C21>6),VLOOKUP(AP17,award2,3),IF((Input!G21=\"Girl\")*AND(Input!C21>6),VLOOKUP(AP17,award2,2),IF((Input!G21=\"Boy\")*AND(Input!C21<=6),VLOOKUP(AP17,award12,3),IF((Input!G21=\"Girl\")*AND(Input!C21<=6),VLOOKUP(AP17,award12,2),0)))))","v":"Step 7"},{"$f":"IF(Input!$C21>6,COUNT(Input!H21:J21,Input!M21:P21,Input!S21,Input!X21:Y21),IF(Input!$C21<=6,COUNT(Input!H21:K21,Input!M21:Q21,Input!S21)))","v":5},0,{"$f":"IF(AS17=0,0,IF((Input!G21=\"Boy\")*AND(Input!C21>6),VLOOKUP(AS17,award2,5),IF((Input!G21=\"Girl\")*AND(Input!C21>6),VLOOKUP(AS17,award2,4),IF((Input!G21=\"Boy\")*AND(Input!C21<=6),VLOOKUP(AS17,award12,5),IF((Input!G21=\"Girl\")*AND(Input!C21<=6),VLOOKUP(AS17,award12,4),0)))))","v":0},null,24.000011000000001,32.000050999999999,28.000091000000001,27.000131,28.000171000000002," "," "," "," "," ",null,{"$f":"IF(AV17=\" \",\" \",IF(Input!$G21=\"Boy\",IF(RANK(AV17,($AV17:$BE17),0)<=5,AV17,\" \"),\" \"))","v":24.000011000000001},{"$f":"IF(AW17=\" \",\" \",IF(Input!$G21=\"Boy\",IF(RANK(AW17,($AV17:$BE17),0)<=5,AW17,\" \"),\" \"))","v":32.000050999999999},{"$f":"IF(AX17=\" \",\" \",IF(Input!$G21=\"Boy\",IF(RANK(AX17,($AV17:$BE17),0)<=5,AX17,\" \"),\" \"))","v":28.000091000000001},{"$f":"IF(AY17=\" \",\" \",IF(Input!$G21=\"Boy\",IF(RANK(AY17,($AV17:$BE17),0)<=5,AY17,\" \"),\" \"))","v":27.000131},{"$f":"IF(AZ17=\" \",\" \",IF(Input!$G21=\"Boy\",IF(RANK(AZ17,($AV17:$BE17),0)<=5,AZ17,\" \"),\" \"))","v":28.000171000000002},{"$f":"IF(BA17=\" \",\" \",IF(Input!$G21=\"Boy\",IF(RANK(BA17,($AV17:$BE17),0)<=5,BA17,\" \"),\" \"))","v":" "},{"$f":"IF(BB17=\" \",\" \",IF(Input!$G21=\"Boy\",IF(RANK(BB17,($AV17:$BE17),0)<=5,BB17,\" \"),\" \"))","v":" "},{"$f":"IF(BC17=\" \",\" \",IF(Input!$G21=\"Boy\",IF(RANK(BC17,($AV17:$BE17),0)<=5,BC17,\" \"),\" \"))","v":" "},{"$f":"IF(BD17=\" \",\" \",IF(Input!$G21=\"Boy\",IF(RANK(BD17,($AV17:$BE17),0)<=5,BD17,\" \"),\" \"))","v":" "},{"$f":"IF(BE17=\" \",\" \",IF(Input!$G21=\"Boy\",IF(RANK(BE17,($AV17:$BE17),0)<=5,BE17,\" \"),\" \"))","v":" "},null,{"$f":"IF(AV17=\" \",\" \",IF(Input!$G21=\"Girl\",IF(RANK(AV17,($AV17:$BE17),0)<=5,AV17,\" \"),\" \"))","v":" "},{"$f":"IF(AW17=\" \",\" \",IF(Input!$G21=\"Girl\",IF(RANK(AW17,($AV17:$BE17),0)<=5,AW17,\" \"),\" \"))","v":" "},{"$f":"IF(AX17=\" \",\" \",IF(Input!$G21=\"Girl\",IF(RANK(AX17,($AV17:$BE17),0)<=5,AX17,\" \"),\" \"))","v":" "},{"$f":"IF(AY17=\" \",\" \",IF(Input!$G21=\"Girl\",IF(RANK(AY17,($AV17:$BE17),0)<=5,AY17,\" \"),\" \"))","v":" "},{"$f":"IF(AZ17=\" \",\" \",IF(Input!$G21=\"Girl\",IF(RANK(AZ17,($AV17:$BE17),0)<=5,AZ17,\" \"),\" \"))","v":" "},{"$f":"IF(BA17=\" \",\" \",IF(Input!$G21=\"Girl\",IF(RANK(BA17,($AV17:$BE17),0)<=5,BA17,\" \"),\" \"))","v":" "},{"$f":"IF(BB17=\" \",\" \",IF(Input!$G21=\"Girl\",IF(RANK(BB17,($AV17:$BE17),0)<=5,BB17,\" \"),\" \"))","v":" "},{"$f":"IF(BC17=\" \",\" \",IF(Input!$G21=\"Girl\",IF(RANK(BC17,($AV17:$BE17),0)<=5,BC17,\" \"),\" \"))","v":" "},{"$f":"IF(BD17=\" \",\" \",IF(Input!$G21=\"Girl\",IF(RANK(BD17,($AV17:$BE17),0)<=5,BD17,\" \"),\" \"))","v":" "},{"$f":"IF(BE17=\" \",\" \",IF(Input!$G21=\"Girl\",IF(RANK(BE17,($AV17:$BE17),0)<=5,BE17,\" \"),\" \"))","v":" "},null,{"$error":"#N/A"},{"$error":"#N/A"},{"$error":"#N/A"},{"$error":"#N/A"},{"$error":"#N/A"}," "," "," "," "," ",null," "," "," "," "," "," "," "," "," "," ",1.1E-5,5.1E-5,9.1000000000000003E-5,1.3100000000000001E-4,1.7100000000000001E-4,2.1100000000000001E-4,2.5099999999999998E-4,2.9100000000000003E-4,3.3100000000000002E-4,3.7100000000000002E-4,24.000011000000001,32.000050999999999,28.000091000000001,27.000131,28.000171000000002," "," "," "," "," "," "," "," "," "," "," "," "," "," "," "," "]
[null,null,{"$f":"Input!D22","v":"Charlotte Keane"},{"$f":"Input!#REF!","v":{"$error":"#REF!"}},{"$f":"Input!E22","v":7},{"$f":"Input!F22","v":11},{"$f":"Input!G22","v":"GIRL"},65,41,33,0,0,29,36,0,0,0,0,0,204,"Step 10"," "," ",204,"204-GIRL-7",{"$f":"Input!D22","v":"Charlotte Keane"},{"$f":"IF(Input!E22=0,0,IF(ISNA(VLOOKUP((CONCATENATE(\"Balance Test-\",Input!H22)),points1,2,)),0,(VLOOKUP((CONCATENATE(\"Balance Test-\",Input!H22)),points1,2,))))","v":65},{"$f":"IF(Input!E22=0,0,IF(ISNA(VLOOKUP((CONCATENATE(\"Standing Long Jump-\",Input!I22)),points1,2,)),0,(VLOOKUP((CONCATENATE(\"Standing Long Jump-\",Input!I22)),points1,2,))))","v":41},{"$f":"IF(Input!E22=0,0,IF(ISNA(VLOOKUP((CONCATENATE(\"Speed Bounce-\",Input!J22)),points1,2,)),0,(VLOOKUP((CONCATENATE(\"Speed Bounce-\",Input!J22)),points1,2,))))","v":33},{"$f":"IF(Input!E22=0,0,IF(ISNA(VLOOKUP((CONCATENATE(\"Target Throw-\",Input!K22)),points1,2,)),0,(VLOOKUP((CONCATENATE(\"Target Throw-\",Input!K22)),points1,2,))))","v":0},{"$f":"IF(Input!E22=0,0,IF(Input!$C22>6,IF(ISNA(VLOOKUP((CONCATENATE(\"Overhead Heave-\",Input!L22)),points1,2,)),0,(VLOOKUP((CONCATENATE(\"Overhead Heave-\",Input!L22)),points1,2,))),0))","v":0},0,{"$f":"IF(Input!E22=0,0,IF(ISNA(VLOOKUP((CONCATENATE(\"Hi-Stepper-\",Input!M22)),points1,2,)),0,(VLOOKUP((CONCATENATE(\"Hi-Stepper-\",Input!M22)),points1,2,))))","v":29},{"$f":"IF(Input!E22=0,0,IF(ISNA(VLOOKUP((CONCATENATE(\"Chest Push-\",Input!N22)),points1,2,)),0,(VLOOKUP((CONCATENATE(\"Chest Push-\",Input!N22)),points1,2,))))","v":36},{"$f":"IF(Input!E22=0,0,IF(ISNA(VLOOKUP((CONCATENATE(\"Vertical Jump-\",Input!O22)),points1,2,)),0,(VLOOKUP((CONCATENATE(\"Vertical Jump-\",Input!O22)),points1,2,))))","v":0},{"$f":"IF(Input!E22=0,0,IF(ISNA(VLOOKUP((CONCATENATE(\"Shuttle Run-\",Input!P22)),points1,2,)),0,(VLOOKUP((CONCATENATE(\"Shuttle Run-\",Input!P22)),points1,2,))))","v":0},{"$f":"IF(Input!E22=0,0,IF(ISNA(VLOOKUP((CONCATENATE(\"Javelin Throw-\",Input!Q22)),points1,2,)),0,(VLOOKUP((CONCATENATE(\"Javelin Throw-\",Input!Q22)),points1,2,))))","v":0},{"$f":"IF(Input!E22=0,0,IF(Input!$C22>6,IF(ISNA(VLOOKUP((CONCATENATE(\"Shot-\",Input!R22)),points1,2,)),0,(VLOOKUP((CONCATENATE(\"Shot-\",Input!R22)),points1,2,))),0))","v":0},0,{"$f":"IF(Input!E22=0,0,IF(ISNA(VLOOKUP((CONCATENATE(\"Standing Triple Jump-\",Input!S22)),points1,2,)),0,(VLOOKUP((CONCATENATE(\"Standing Triple Jump-\",Input!S22)),points1,2,))))","v":0},{"$f":"IF(Input!$C22>6,COUNT(Input!H22:J22,Input!M22:P22,Input!S22,Input!X22:Y22),IF(Input!$C22<=6,COUNT(Input!H22:K22,Input!M22:Q22,Input!S22)))","v":5},{"$f":"IF(AO18>=5,(LARGE((AA18:AC18,AF18:AJ18,AM18:AN18),1))+LARGE((AA18:AC18,AF18:AJ18,AM18:AN18),2)+LARGE((AA18:AC18,AF18:AJ18,AM18:AN18),3)+LARGE((AA18:AC18,AF18:AJ18,AM18:AN18),4)+LARGE((AA18:AC18,AF18:AJ18,AM18:AN18),5),0)","v":204},{"$f":"IF(AP18=0,0,IF((Input!G22=\"Boy\")*AND(Input!C22>6),VLOOKUP(AP18,award2,3),IF((Input!G22=\"Girl\")*AND(Input!C22>6),VLOOKUP(AP18,award2,2),IF((Input!G22=\"Boy\")*AND(Input!C22<=6),VLOOKUP(AP18,award12,3),IF((Input!G22=\"Girl\")*AND(Input!C22<=6),VLOOKUP(AP18,award12,2),0)))))","v":"Step 10"},{"$f":"IF(Input!$C22>6,COUNT(Input!H22:J22,Input!M22:P22,Input!S22,Input!X22:Y22),IF(Input!$C22<=6,COUNT(Input!H22:K22,Input!M22:Q22,Input!S22)))","v":5},0,{"$f":"IF(AS18=0,0,IF((Input!G22=\"Boy\")*AND(Input!C22>6),VLOOKUP(AS18,award2,5),IF((Input!G22=\"Girl\")*AND(Input!C22>6),VLOOKUP(AS18,award2,4),IF((Input!G22=\"Boy\")*AND(Input!C22<=6),VLOOKUP(AS18,award12,5),IF((Input!G22=\"Girl\")*AND(Input!C22<=6),VLOOKUP(AS18,award12,4),0)))))","v":0},null,65.000011999999998,41.000051999999997,33.000092000000002," ",29.000171999999999,36.000211999999998," "," "," "," ",null,{"$f":"IF(AV18=\" \",\" \",IF(Input!$G22=\"Boy\",IF(RANK(AV18,($AV18:$BE18),0)<=5,AV18,\" \"),\" \"))","v":" "},{"$f":"IF(AW18=\" \",\" \",IF(Input!$G22=\"Boy\",IF(RANK(AW18,($AV18:$BE18),0)<=5,AW18,\" \"),\" \"))","v":" "},{"$f":"IF(AX18=\" \",\" \",IF(Input!$G22=\"Boy\",IF(RANK(AX18,($AV18:$BE18),0)<=5,AX18,\" \"),\" \"))","v":" "},{"$f":"IF(AY18=\" \",\" \",IF(Input!$G22=\"Boy\",IF(RANK(AY18,($AV18:$BE18),0)<=5,AY18,\" \"),\" \"))","v":" "},{"$f":"IF(AZ18=\" \",\" \",IF(Input!$G22=\"Boy\",IF(RANK(AZ18,($AV18:$BE18),0)<=5,AZ18,\" \"),\" \"))","v":" "},{"$f":"IF(BA18=\" \",\" \",IF(Input!$G22=\"Boy\",IF(RANK(BA18,($AV18:$BE18),0)<=5,BA18,\" \"),\" \"))","v":" "},{"$f":"IF(BB18=\" \",\" \",IF(Input!$G22=\"Boy\",IF(RANK(BB18,($AV18:$BE18),0)<=5,BB18,\" \"),\" \"))","v":" "},{"$f":"IF(BC18=\" \",\" \",IF(Input!$G22=\"Boy\",IF(RANK(BC18,($AV18:$BE18),0)<=5,BC18,\" \"),\" \"))","v":" "},{"$f":"IF(BD18=\" \",\" \",IF(Input!$G22=\"Boy\",IF(RANK(BD18,($AV18:$BE18),0)<=5,BD18,\" \"),\" \"))","v":" "},{"$f":"IF(BE18=\" \",\" \",IF(Input!$G22=\"Boy\",IF(RANK(BE18,($AV18:$BE18),0)<=5,BE18,\" \"),\" \"))","v":" "},null,{"$f":"IF(AV18=\" \",\" \",IF(Input!$G22=\"Girl\",IF(RANK(AV18,($AV18:$BE18),0)<=5,AV18,\" \"),\" \"))","v":65.000011999999998},{"$f":"IF(AW18=\" \",\" \",IF(Input!$G22=\"Girl\",IF(RANK(AW18,($AV18:$BE18),0)<=5,AW18,\" \"),\" \"))","v":41.000051999999997},{"$f":"IF(AX18=\" \",\" \",IF(Input!$G22=\"Girl\",IF(RANK(AX18,($AV18:$BE18),0)<=5,AX18,\" \"),\" \"))","v":33.000092000000002},{"$f":"IF(AY18=\" \",\" \",IF(Input!$G22=\"Girl\",IF(RANK(AY18,($AV18:$BE18),0)<=5,AY18,\" \"),\" \"))","v":" "},{"$f":"IF(AZ18=\" \",\" \",IF(Input!$G22=\"Girl\",IF(RANK(AZ18,($AV18:$BE18),0)<=5,AZ18,\" \"),\" \"))","v":29.000171999999999},{"$f":"IF(BA18=\" \",\" \",IF(Input!$G22=\"Girl\",IF(RANK(BA18,($AV18:$BE18),0)<=5,BA18,\" \"),\" \"))","v":36.000211999999998},{"$f":"IF(BB18=\" \",\" \",IF(Input!$G22=\"Girl\",IF(RANK(BB18,($AV18:$BE18),0)<=5,BB18,\" \"),\" \"))","v":" "},{"$f":"IF(BC18=\" \",\" \",IF(Input!$G22=\"Girl\",IF(RANK(BC18,($AV18:$BE18),0)<=5,BC18,\" \"),\" \"))","v":" "},{"$f":"IF(BD18=\" \",\" \",IF(Input!$G22=\"Girl\",IF(RANK(BD18,($AV18:$BE18),0)<=5,BD18,\" \"),\" \"))","v":" "},{"$f":"IF(BE18=\" \",\" \",IF(Input!$G22=\"Girl\",IF(RANK(BE18,($AV18:$BE18),0)<=5,BE18,\" \"),\" \"))","v":" "},null," "," "," "," "," "," "," "," "," "," ",null,"RED",{"$error":"#N/A"},"RED"," ",{"$error":"#N/A"},"RED"," "," "," "," ",1.2E-5,5.1999999999999997E-5,9.2E-5,1.3200000000000001E-4,1.7200000000000001E-4,2.12E-4,2.52E-4,2.92E-4,3.3199999999999999E-4,3.7199999999999999E-4," "," "," "," "," "," "," "," "," "," "," ",65.000011999999998,41.000051999999997,33.000092000000002," ",29.000171999999999,36.000211999999998," "," "," "," "]
[null,null,{"$f":"Input!D23","v":"Arti Mead"},{"$f":"Input!#REF!","v":{"$error":"#REF!"}},{"$f":"Input!E23","v":8},{"$f":"Input!F23","v":12},{"$f":"Input!G23","v":"BOY"},56,32,32,0,0,46,36,0,0,0,0,0,202,"Step 9"," "," ",202,"202-BOY-8",{"$f":"Input!D23","v":"Arti Mead"},{"$f":"IF(Input!E23=0,0,IF(ISNA(VLOOKUP((CONCATENATE(\"Balance Test-\",Input!H23)),points1,2,)),0,(VLOOKUP((CONCATENATE(\"Balance Test-\",Input!H23)),points1,2,))))","v":56},{"$f":"IF(Input!E23=0,0,IF(ISNA(VLOOKUP((CONCATENATE(\"Standing Long Jump-\",Input!I23)),points1,2,)),0,(VLOOKUP((CONCATENATE(\"Standing Long Jump-\",Input!I23)),points1,2,))))","v":32},{"$f":"IF(Input!E23=0,0,IF(ISNA(VLOOKUP((CONCATENATE(\"Speed Bounce-\",Input!J23)),points1,2,)),0,(VLOOKUP((CONCATENATE(\"Speed Bounce-\",Input!J23)),points1,2,))))","v":32},{"$f":"IF(Input!E23=0,0,IF(ISNA(VLOOKUP((CONCATENATE(\"Target Throw-\",Input!K23)),points1,2,)),0,(VLOOKUP((CONCATENATE(\"Target Throw-\",Input!K23)),points1,2,))))","v":0},{"$f":"IF(Input!E23=0,0,IF(Input!$C23>6,IF(ISNA(VLOOKUP((CONCATENATE(\"Overhead Heave-\",Input!L23)),points1,2,)),0,(VLOOKUP((CONCATENATE(\"Overhead Heave-\",Input!L23)),points1,2,))),0))","v":0},0,{"$f":"IF(Input!E23=0,0,IF(ISNA(VLOOKUP((CONCATENATE(\"Hi-Stepper-\",Input!M23)),points1,2,)),0,(VLOOKUP((CONCATENATE(\"Hi-Stepper-\",Input!M23)),points1,2,))))","v":46},{"$f":"IF(Input!E23=0,0,IF(ISNA(VLOOKUP((CONCATENATE(\"Chest Push-\",Input!N23)),points1,2,)),0,(VLOOKUP((CONCATENATE(\"Chest Push-\",Input!N23)),points1,2,))))","v":36},{"$f":"IF(Input!E23=0,0,IF(ISNA(VLOOKUP((CONCATENATE(\"Vertical Jump-\",Input!O23)),points1,2,)),0,(VLOOKUP((CONCATENATE(\"Vertical Jump-\",Input!O23)),points1,2,))))","v":0},{"$f":"IF(Input!E23=0,0,IF(ISNA(VLOOKUP((CONCATENATE(\"Shuttle Run-\",Input!P23)),points1,2,)),0,(VLOOKUP((CONCATENATE(\"Shuttle Run-\",Input!P23)),points1,2,))))","v":0},{"$f":"IF(Input!E23=0,0,IF(ISNA(VLOOKUP((CONCATENATE(\"Javelin Throw-\",Input!Q23)),points1,2,)),0,(VLOOKUP((CONCATENATE(\"Javelin Throw-\",Input!Q23)),points1,2,))))","v":0},{"$f":"IF(Input!E23=0,0,IF(Input!$C23>6,IF(ISNA(VLOOKUP((CONCATENATE(\"Shot-\",Input!R23)),points1,2,)),0,(VLOOKUP((CONCATENATE(\"Shot-\",Input!R23)),points1,2,))),0))","v":0},0,{"$f":"IF(Input!E23=0,0,IF(ISNA(VLOOKUP((CONCATENATE(\"Standing Triple Jump-\",Input!S23)),points1,2,)),0,(VLOOKUP((CONCATENATE(\"Standing Triple Jump-\",Input!S23)),points1,2,))))","v":0},{"$f":"IF(Input!$C23>6,COUNT(Input!H23:J23,Input!M23:P23,Input!S23,Input!X23:Y23),IF(Input!$C23<=6,COUNT(Input!H23:K23,Input!M23:Q23,Input!S23)))","v":5},{"$f":"IF(AO19>=5,(LARGE((AA19:AC19,AF19:AJ19,AM19:AN19),1))+LARGE((AA19:AC19,AF19:AJ19,AM19:AN19),2)+LARGE((AA19:AC19,AF19:AJ19,AM19:AN19),3)+LARGE((AA19:AC19,AF19:AJ19,AM19:AN19),4)+LARGE((AA19:AC19,AF19:AJ19,AM19:AN19),5),0)","v":202},{"$f":"IF(AP19=0,0,IF((Input!G23=\"Boy\")*AND(Input!C23>6),VLOOKUP(AP19,award2,3),IF((Input!G23=\"Girl\")*AND(Input!C23>6),VLOOKUP(AP19,award2,2),IF((Input!G23=\"Boy\")*AND(Input!C23<=6),VLOOKUP(AP19,award12,3),IF((Input!G23=\"Girl\")*AND(Input!C23<=6),VLOOKUP(AP19,award12,2),0)))))","v":"Step 9"},{"$f":"IF(Input!$C23>6,COUNT(Input!H23:J23,Input!M23:P23,Input!S23,Input!X23:Y23),IF(Input!$C23<=6,COUNT(Input!H23:K23,Input!M23:Q23,Input!S23)))","v":5},0,{"$f":"IF(AS19=0,0,IF((Input!G23=\"Boy\")*AND(Input!C23>6),VLOOKUP(AS19,award2,5),IF((Input!G23=\"Girl\")*AND(Input!C23>6),VLOOKUP(AS19,award2,4),IF((Input!G23=\"Boy\")*AND(Input!C23<=6),VLOOKUP(AS19,award12,5),IF((Input!G23=\"Girl\")*AND(Input!C23<=6),VLOOKUP(AS19,award12,4),0)))))","v":0},null,56.000013000000003,32.000053000000001,32.000093," ",46.000172999999997,36.000213000000002," "," "," "," ",null,{"$f":"IF(AV19=\" \",\" \",IF(Input!$G23=\"Boy\",IF(RANK(AV19,($AV19:$BE19),0)<=5,AV19,\" \"),\" \"))","v":56.000013000000003},{"$f":"IF(AW19=\" \",\" \",IF(Input!$G23=\"Boy\",IF(RANK(AW19,($AV19:$BE19),0)<=5,AW19,\" \"),\" \"))","v":32.000053000000001},{"$f":"IF(AX19=\" \",\" \",IF(Input!$G23=\"Boy\",IF(RANK(AX19,($AV19:$BE19),0)<=5,AX19,\" \"),\" \"))","v":32.000093},{"$f":"IF(AY19=\" \",\" \",IF(Input!$G23=\"Boy\",IF(RANK(AY19,($AV19:$BE19),0)<=5,AY19,\" \"),\" \"))","v":" "},{"$f":"IF(AZ19=\" \",\" \",IF(Input!$G23=\"Boy\",IF(RANK(AZ19,($AV19:$BE19),0)<=5,AZ19,\" \"),\" \"))","v":46.000172999999997},{"$f":"IF(BA19=\" \",\" \",IF(Input!$G23=\"Boy\",IF(RANK(BA19,($AV19:$BE19),0)<=5,BA19,\" \"),\" \"))","v":36.000213000000002},{"$f":"IF(BB19=\" \",\" \",IF(Input!$G23=\"Boy\",IF(RANK(BB19,($AV19:$BE19),0)<=5,BB19,\" \"),\" \"))","v":" "},{"$f":"IF(BC19=\" \",\" \",IF(Input!$G23=\"Boy\",IF(RANK(BC19,($AV19:$BE19),0)<=5,BC19,\" \"),\" \"))","v":" "},{"$f":"IF(BD19=\" \",\" \",IF(Input!$G23=\"Boy\",IF(RANK(BD19,($AV19:$BE19),0)<=5,BD19,\" \"),\" \"))","v":" "},{"$f":"IF(BE19=\" \",\" \",IF(Input!$G23=\"Boy\",IF(RANK(BE19,($AV19:$BE19),0)<=5,BE19,\" \"),\" \"))","v":" "},null,{"$f":"IF(AV19=\" \",\" \",IF(Input!$G23=\"Girl\",IF(RANK(AV19,($AV19:$BE19),0)<=5,AV19,\" \"),\" \"))","v":" "},{"$f":"IF(AW19=\" \",\" \",IF(Input!$G23=\"Girl\",IF(RANK(AW19,($AV19:$BE19),0)<=5,AW19,\" \"),\" \"))","v":" "},{"$f":"IF(AX19=\" \",\" \",IF(Input!$G23=\"Girl\",IF(RANK(AX19,($AV19:$BE19),0)<=5,AX19,\" \"),\" \"))","v":" "},{"$f":"IF(AY19=\" \",\" \",IF(Input!$G23=\"Girl\",IF(RANK(AY19,($AV19:$BE19),0)<=5,AY19,\" \"),\" \"))","v":" "},{"$f":"IF(AZ19=\" \",\" \",IF(Input!$G23=\"Girl\",IF(RANK(AZ19,($AV19:$BE19),0)<=5,AZ19,\" \"),\" \"))","v":" "},{"$f":"IF(BA19=\" \",\" \",IF(Input!$G23=\"Girl\",IF(RANK(BA19,($AV19:$BE19),0)<=5,BA19,\" \"),\" \"))","v":" "},{"$f":"IF(BB19=\" \",\" \",IF(Input!$G23=\"Girl\",IF(RANK(BB19,($AV19:$BE19),0)<=5,BB19,\" \"),\" \"))","v":" "},{"$f":"IF(BC19=\" \",\" \",IF(Input!$G23=\"Girl\",IF(RANK(BC19,($AV19:$BE19),0)<=5,BC19,\" \"),\" \"))","v":" "},{"$f":"IF(BD19=\" \",\" \",IF(Input!$G23=\"Girl\",IF(RANK(BD19,($AV19:$BE19),0)<=5,BD19,\" \"),\" \"))","v":" "},{"$f":"IF(BE19=\" \",\" \",IF(Input!$G23=\"Girl\",IF(RANK(BE19,($AV19:$BE19),0)<=5,BE19,\" \"),\" \"))","v":" "},null,"RED",{"$error":"#N/A"}," "," ","RED","RED"," "," "," "," ",null," "," "," "," "," "," "," "," "," "," ",1.2999999999999999E-5,5.3000000000000001E-5,9.2999999999999997E-5,1.3300000000000001E-4,1.73E-4,2.13E-4,2.5300000000000002E-4,2.9300000000000002E-4,3.3300000000000002E-4,3.7300000000000001E-4,56.000013000000003,32.000053000000001,32.000093," ",46.000172999999997,36.000213000000002," "," "," "," "," "," "," "," "," "," "," "," "," "," "," "]
[null,null,{"$f":"Input!D24","v":"Sid Mead"},{"$f":"Input!#REF!","v":{"$error":"#REF!"}},{"$f":"Input!E24","v":7},{"$f":"Input!F24","v":11},{"$f":"Input!G24","v":"BOY"},44,18,30,0,0,39,31,0,0,0,0,0,162,"Step 7"," "," ",162,"162-BOY-7",{"$f":"Input!D24","v":"Sid Mead"},{"$f":"IF(Input!E24=0,0,IF(ISNA(VLOOKUP((CONCATENATE(\"Balance Test-\",Input!H24)),points1,2,)),0,(VLOOKUP((CONCATENATE(\"Balance Test-\",Input!H24)),points1,2,))))","v":44},{"$f":"IF(Input!E24=0,0,IF(ISNA(VLOOKUP((CONCATENATE(\"Standing Long Jump-\",Input!I24)),points1,2,)),0,(VLOOKUP((CONCATENATE(\"Standing Long Jump-\",Input!I24)),points1,2,))))","v":18},{"$f":"IF(Input!E24=0,0,IF(ISNA(VLOOKUP((CONCATENATE(\"Speed Bounce-\",Input!J24)),points1,2,)),0,(VLOOKUP((CONCATENATE(\"Speed Bounce-\",Input!J24)),points1,2,))))","v":30},{"$f":"IF(Input!E24=0,0,IF(ISNA(VLOOKUP((CONCATENATE(\"Target Throw-\",Input!K24)),points1,2,)),0,(VLOOKUP((CONCATENATE(\"Target Throw-\",Input!K24)),points1,2,))))","v":0},{"$f":"IF(Input!E24=0,0,IF(Input!$C24>6,IF(ISNA(VLOOKUP((CONCATENATE(\"Overhead Heave-\",Input!L24)),points1,2,)),0,(VLOOKUP((CONCATENATE(\"Overhead Heave-\",Input!L24)),points1,2,))),0))","v":0},0,{"$f":"IF(Input!E24=0,0,IF(ISNA(VLOOKUP((CONCATENATE(\"Hi-Stepper-\",Input!M24)),points1,2,)),0,(VLOOKUP((CONCATENATE(\"Hi-Stepper-\",Input!M24)),points1,2,))))","v":39},{"$f":"IF(Input!E24=0,0,IF(ISNA(VLOOKUP((CONCATENATE(\"Chest Push-\",Input!N24)),points1,2,)),0,(VLOOKUP((CONCATENATE(\"Chest Push-\",Input!N24)),points1,2,))))","v":31},{"$f":"IF(Input!E24=0,0,IF(ISNA(VLOOKUP((CONCATENATE(\"Vertical Jump-\",Input!O24)),points1,2,)),0,(VLOOKUP((CONCATENATE(\"Vertical Jump-\",Input!O24)),points1,2,))))","v":0},{"$f":"IF(Input!E24=0,0,IF(ISNA(VLOOKUP((CONCATENATE(\"Shuttle Run-\",Input!P24)),points1,2,)),0,(VLOOKUP((CONCATENATE(\"Shuttle Run-\",Input!P24)),points1,2,))))","v":0},{"$f":"IF(Input!E24=0,0,IF(ISNA(VLOOKUP((CONCATENATE(\"Javelin Throw-\",Input!Q24)),points1,2,)),0,(VLOOKUP((CONCATENATE(\"Javelin Throw-\",Input!Q24)),points1,2,))))","v":0},{"$f":"IF(Input!E24=0,0,IF(Input!$C24>6,IF(ISNA(VLOOKUP((CONCATENATE(\"Shot-\",Input!R24)),points1,2,)),0,(VLOOKUP((CONCATENATE(\"Shot-\",Input!R24)),points1,2,))),0))","v":0},0,{"$f":"IF(Input!E24=0,0,IF(ISNA(VLOOKUP((CONCATENATE(\"Standing Triple Jump-\",Input!S24)),points1,2,)),0,(VLOOKUP((CONCATENATE(\"Standing Triple Jump-\",Input!S24)),points1,2,))))","v":0},{"$f":"IF(Input!$C24>6,COUNT(Input!H24:J24,Input!M24:P24,Input!S24,Input!X24:Y24),IF(Input!$C24<=6,COUNT(Input!H24:K24,Input!M24:Q24,Input!S24)))","v":5},{"$f":"IF(AO20>=5,(LARGE((AA20:AC20,AF20:AJ20,AM20:AN20),1))+LARGE((AA20:AC20,AF20:AJ20,AM20:AN20),2)+LARGE((AA20:AC20,AF20:AJ20,AM20:AN20),3)+LARGE((AA20:AC20,AF20:AJ20,AM20:AN20),4)+LARGE((AA20:AC20,AF20:AJ20,AM20:AN20),5),0)","v":162},{"$f":"IF(AP20=0,0,IF((Input!G24=\"Boy\")*AND(Input!C24>6),VLOOKUP(AP20,award2,3),IF((Input!G24=\"Girl\")*AND(Input!C24>6),VLOOKUP(AP20,award2,2),IF((Input!G24=\"Boy\")*AND(Input!C24<=6),VLOOKUP(AP20,award12,3),IF((Input!G24=\"Girl\")*AND(Input!C24<=6),VLOOKUP(AP20,award12,2),0)))))","v":"Step 7"},{"$f":"IF(Input!$C24>6,COUNT(Input!H24:J24,Input!M24:P24,Input!S24,Input!X24:Y24),IF(Input!$C24<=6,COUNT(Input!H24:K24,Input!M24:Q24,Input!S24)))","v":5},0,{"$f":"IF(AS20=0,0,IF((Input!G24=\"Boy\")*AND(Input!C24>6),VLOOKUP(AS20,award2,5),IF((Input!G24=\"Girl\")*AND(Input!C24>6),VLOOKUP(AS20,award2,4),IF((Input!G24=\"Boy\")*AND(Input!C24<=6),VLOOKUP(AS20,award12,5),IF((Input!G24=\"Girl\")*AND(Input!C24<=6),VLOOKUP(AS20,award12,4),0)))))","v":0},null,44.000014,18.000053999999999,30.000094000000001," ",39.000174000000001,31.000214," "," "," "," ",null,{"$f":"IF(AV20=\" \",\" \",IF(Input!$G24=\"Boy\",IF(RANK(AV20,($AV20:$BE20),0)<=5,AV20,\" \"),\" \"))","v":44.000014},{"$f":"IF(AW20=\" \",\" \",IF(Input!$G24=\"Boy\",IF(RANK(AW20,($AV20:$BE20),0)<=5,AW20,\" \"),\" \"))","v":18.000053999999999},{"$f":"IF(AX20=\" \",\" \",IF(Input!$G24=\"Boy\",IF(RANK(AX20,($AV20:$BE20),0)<=5,AX20,\" \"),\" \"))","v":30.000094000000001},{"$f":"IF(AY20=\" \",\" \",IF(Input!$G24=\"Boy\",IF(RANK(AY20,($AV20:$BE20),0)<=5,AY20,\" \"),\" \"))","v":" "},{"$f":"IF(AZ20=\" \",\" \",IF(Input!$G24=\"Boy\",IF(RANK(AZ20,($AV20:$BE20),0)<=5,AZ20,\" \"),\" \"))","v":39.000174000000001},{"$f":"IF(BA20=\" \",\" \",IF(Input!$G24=\"Boy\",IF(RANK(BA20,($AV20:$BE20),0)<=5,BA20,\" \"),\" \"))","v":31.000214},{"$f":"IF(BB20=\" \",\" \",IF(Input!$G24=\"Boy\",IF(RANK(BB20,($AV20:$BE20),0)<=5,BB20,\" \"),\" \"))","v":" "},{"$f":"IF(BC20=\" \",\" \",IF(Input!$G24=\"Boy\",IF(RANK(BC20,($AV20:$BE20),0)<=5,BC20,\" \"),\" \"))","v":" "},{"$f":"IF(BD20=\" \",\" \",IF(Input!$G24=\"Boy\",IF(RANK(BD20,($AV20:$BE20),0)<=5,BD20,\" \"),\" \"))","v":" "},{"$f":"IF(BE20=\" \",\" \",IF(Input!$G24=\"Boy\",IF(RANK(BE20,($AV20:$BE20),0)<=5,BE20,\" \"),\" \"))","v":" "},null,{"$f":"IF(AV20=\" \",\" \",IF(Input!$G24=\"Girl\",IF(RANK(AV20,($AV20:$BE20),0)<=5,AV20,\" \"),\" \"))","v":" "},{"$f":"IF(AW20=\" \",\" \",IF(Input!$G24=\"Girl\",IF(RANK(AW20,($AV20:$BE20),0)<=5,AW20,\" \"),\" \"))","v":" "},{"$f":"IF(AX20=\" \",\" \",IF(Input!$G24=\"Girl\",IF(RANK(AX20,($AV20:$BE20),0)<=5,AX20,\" \"),\" \"))","v":" "},{"$f":"IF(AY20=\" \",\" \",IF(Input!$G24=\"Girl\",IF(RANK(AY20,($AV20:$BE20),0)<=5,AY20,\" \"),\" \"))","v":" "},{"$f":"IF(AZ20=\" \",\" \",IF(Input!$G24=\"Girl\",IF(RANK(AZ20,($AV20:$BE20),0)<=5,AZ20,\" \"),\" \"))","v":" "},{"$f":"IF(BA20=\" \",\" \",IF(Input!$G24=\"Girl\",IF(RANK(BA20,($AV20:$BE20),0)<=5,BA20,\" \"),\" \"))","v":" "},{"$f":"IF(BB20=\" \",\" \",IF(Input!$G24=\"Girl\",IF(RANK(BB20,($AV20:$BE20),0)<=5,BB20,\" \"),\" \"))","v":" "},{"$f":"IF(BC20=\" \",\" \",IF(Input!$G24=\"Girl\",IF(RANK(BC20,($AV20:$BE20),0)<=5,BC20,\" \"),\" \"))","v":" "},{"$f":"IF(BD20=\" \",\" \",IF(Input!$G24=\"Girl\",IF(RANK(BD20,($AV20:$BE20),0)<=5,BD20,\" \"),\" \"))","v":" "},{"$f":"IF(BE20=\" \",\" \",IF(Input!$G24=\"Girl\",IF(RANK(BE20,($AV20:$BE20),0)<=5,BE20,\" \"),\" \"))","v":" "},null,{"$error":"#N/A"},{"$error":"#N/A"},{"$error":"#N/A"}," ","RED"," "," "," "," "," ",null," "," "," "," "," "," "," "," "," "," ",1.4E-5,5.3999999999999998E-5,9.3999999999999994E-5,1.34E-4,1.74E-4,2.14E-4,2.5399999999999999E-4,2.9399999999999999E-4,3.3399999999999999E-4,3.7399999999999998E-4,44.000014,18.000053999999999,30.000094000000001," ",39.000174000000001,31.000214," "," "," "," "," "," "," "," "," "," "," "," "," "," "," "]
[null,null,{"$f":"Input!D25","v":"Arron O'Dwyer"},{"$f":"Input!#REF!","v":{"$error":"#REF!"}},{"$f":"Input!E25","v":7},{"$f":"Input!F25","v":11},{"$f":"Input!G25","v":"BOY"},65,50,42,0,0,46,40,0,0,0,0,0,243,"Bronze"," "," ",243,"243-BOY-7",{"$f":"Input!D25","v":"Arron O'Dwyer"},{"$f":"IF(Input!E25=0,0,IF(ISNA(VLOOKUP((CONCATENATE(\"Balance Test-\",Input!H25)),points1,2,)),0,(VLOOKUP((CONCATENATE(\"Balance Test-\",Input!H25)),points1,2,))))","v":65},{"$f":"IF(Input!E25=0,0,IF(ISNA(VLOOKUP((CONCATENATE(\"Standing Long Jump-\",Input!I25)),points1,2,)),0,(VLOOKUP((CONCATENATE(\"Standing Long Jump-\",Input!I25)),points1,2,))))","v":50},{"$f":"IF(Input!E25=0,0,IF(ISNA(VLOOKUP((CONCATENATE(\"Speed Bounce-\",Input!J25)),points1,2,)),0,(VLOOKUP((CONCATENATE(\"Speed Bounce-\",Input!J25)),points1,2,))))","v":42},{"$f":"IF(Input!E25=0,0,IF(ISNA(VLOOKUP((CONCATENATE(\"Target Throw-\",Input!K25)),points1,2,)),0,(VLOOKUP((CONCATENATE(\"Target Throw-\",Input!K25)),points1,2,))))","v":0},{"$f":"IF(Input!E25=0,0,IF(Input!$C25>6,IF(ISNA(VLOOKUP((CONCATENATE(\"Overhead Heave-\",Input!L25)),points1,2,)),0,(VLOOKUP((CONCATENATE(\"Overhead Heave-\",Input!L25)),points1,2,))),0))","v":0},0,{"$f":"IF(Input!E25=0,0,IF(ISNA(VLOOKUP((CONCATENATE(\"Hi-Stepper-\",Input!M25)),points1,2,)),0,(VLOOKUP((CONCATENATE(\"Hi-Stepper-\",Input!M25)),points1,2,))))","v":46},{"$f":"IF(Input!E25=0,0,IF(ISNA(VLOOKUP((CONCATENATE(\"Chest Push-\",Input!N25)),points1,2,)),0,(VLOOKUP((CONCATENATE(\"Chest Push-\",Input!N25)),points1,2,))))","v":40},{"$f":"IF(Input!E25=0,0,IF(ISNA(VLOOKUP((CONCATENATE(\"Vertical Jump-\",Input!O25)),points1,2,)),0,(VLOOKUP((CONCATENATE(\"Vertical Jump-\",Input!O25)),points1,2,))))","v":0},{"$f":"IF(Input!E25=0,0,IF(ISNA(VLOOKUP((CONCATENATE(\"Shuttle Run-\",Input!P25)),points1,2,)),0,(VLOOKUP((CONCATENATE(\"Shuttle Run-\",Input!P25)),points1,2,))))","v":0},{"$f":"IF(Input!E25=0,0,IF(ISNA(VLOOKUP((CONCATENATE(\"Javelin Throw-\",Input!Q25)),points1,2,)),0,(VLOOKUP((CONCATENATE(\"Javelin Throw-\",Input!Q25)),points1,2,))))","v":0},{"$f":"IF(Input!E25=0,0,IF(Input!$C25>6,IF(ISNA(VLOOKUP((CONCATENATE(\"Shot-\",Input!R25)),points1,2,)),0,(VLOOKUP((CONCATENATE(\"Shot-\",Input!R25)),points1,2,))),0))","v":0},0,{"$f":"IF(Input!E25=0,0,IF(ISNA(VLOOKUP((CONCATENATE(\"Standing Triple Jump-\",Input!S25)),points1,2,)),0,(VLOOKUP((CONCATENATE(\"Standing Triple Jump-\",Input!S25)),points1,2,))))","v":0},{"$f":"IF(Input!$C25>6,COUNT(Input!H25:J25,Input!M25:P25,Input!S25,Input!X25:Y25),IF(Input!$C25<=6,COUNT(Input!H25:K25,Input!M25:Q25,Input!S25)))","v":5},{"$f":"IF(AO21>=5,(LARGE((AA21:AC21,AF21:AJ21,AM21:AN21),1))+LARGE((AA21:AC21,AF21:AJ21,AM21:AN21),2)+LARGE((AA21:AC21,AF21:AJ21,AM21:AN21),3)+LARGE((AA21:AC21,AF21:AJ21,AM21:AN21),4)+LARGE((AA21:AC21,AF21:AJ21,AM21:AN21),5),0)","v":243},{"$f":"IF(AP21=0,0,IF((Input!G25=\"Boy\")*AND(Input!C25>6),VLOOKUP(AP21,award2,3),IF((Input!G25=\"Girl\")*AND(Input!C25>6),VLOOKUP(AP21,award2,2),IF((Input!G25=\"Boy\")*AND(Input!C25<=6),VLOOKUP(AP21,award12,3),IF((Input!G25=\"Girl\")*AND(Input!C25<=6),VLOOKUP(AP21,award12,2),0)))))","v":"Bronze"},{"$f":"IF(Input!$C25>6,COUNT(Input!H25:J25,Input!M25:P25,Input!S25,Input!X25:Y25),IF(Input!$C25<=6,COUNT(Input!H25:K25,Input!M25:Q25,Input!S25)))","v":5},0,{"$f":"IF(AS21=0,0,IF((Input!G25=\"Boy\")*AND(Input!C25>6),VLOOKUP(AS21,award2,5),IF((Input!G25=\"Girl\")*AND(Input!C25>6),VLOOKUP(AS21,award2,4),IF((Input!G25=\"Boy\")*AND(Input!C25<=6),VLOOKUP(AS21,award12,5),IF((Input!G25=\"Girl\")*AND(Input!C25<=6),VLOOKUP(AS21,award12,4),0)))))","v":0},null,65.000015000000005,50.000055000000003,42.000095000000002," ",46.000174999999999,40.000214999999997," "," "," "," ",null,{"$f":"IF(AV21=\" \",\" \",IF(Input!$G25=\"Boy\",IF(RANK(AV21,($AV21:$BE21),0)<=5,AV21,\" \"),\" \"))","v":65.000015000000005},{"$f":"IF(AW21=\" \",\" \",IF(Input!$G25=\"Boy\",IF(RANK(AW21,($AV21:$BE21),0)<=5,AW21,\" \"),\" \"))","v":50.000055000000003},{"$f":"IF(AX21=\" \",\" \",IF(Input!$G25=\"Boy\",IF(RANK(AX21,($AV21:$BE21),0)<=5,AX21,\" \"),\" \"))","v":42.000095000000002},{"$f":"IF(AY21=\" \",\" \",IF(Input!$G25=\"Boy\",IF(RANK(AY21,($AV21:$BE21),0)<=5,AY21,\" \"),\" \"))","v":" "},{"$f":"IF(AZ21=\" \",\" \",IF(Input!$G25=\"Boy\",IF(RANK(AZ21,($AV21:$BE21),0)<=5,AZ21,\" \"),\" \"))","v":46.000174999999999},{"$f":"IF(BA21=\" \",\" \",IF(Input!$G25=\"Boy\",IF(RANK(BA21,($AV21:$BE21),0)<=5,BA21,\" \"),\" \"))","v":40.000214999999997},{"$f":"IF(BB21=\" \",\" \",IF(Input!$G25=\"Boy\",IF(RANK(BB21,($AV21:$BE21),0)<=5,BB21,\" \"),\" \"))","v":" "},{"$f":"IF(BC21=\" \",\" \",IF(Input!$G25=\"Boy\",IF(RANK(BC21,($AV21:$BE21),0)<=5,BC21,\" \"),\" \"))","v":" "},{"$f":"IF(BD21=\" \",\" \",IF(Input!$G25=\"Boy\",IF(RANK(BD21,($AV21:$BE21),0)<=5,BD21,\" \"),\" \"))","v":" "},{"$f":"IF(BE21=\" \",\" \",IF(Input!$G25=\"Boy\",IF(RANK(BE21,($AV21:$BE21),0)<=5,BE21,\" \"),\" \"))","v":" "},null,{"$f":"IF(AV21=\" \",\" \",IF(Input!$G25=\"Girl\",IF(RANK(AV21,($AV21:$BE21),0)<=5,AV21,\" \"),\" \"))","v":" "},{"$f":"IF(AW21=\" \",\" \",IF(Input!$G25=\"Girl\",IF(RANK(AW21,($AV21:$BE21),0)<=5,AW21,\" \"),\" \"))","v":" "},{"$f":"IF(AX21=\" \",\" \",IF(Input!$G25=\"Girl\",IF(RANK(AX21,($AV21:$BE21),0)<=5,AX21,\" \"),\" \"))","v":" "},{"$f":"IF(AY21=\" \",\" \",IF(Input!$G25=\"Girl\",IF(RANK(AY21,($AV21:$BE21),0)<=5,AY21,\" \"),\" \"))","v":" "},{"$f":"IF(AZ21=\" \",\" \",IF(Input!$G25=\"Girl\",IF(RANK(AZ21,($AV21:$BE21),0)<=5,AZ21,\" \"),\" \"))","v":" "},{"$f":"IF(BA21=\" \",\" \",IF(Input!$G25=\"Girl\",IF(RANK(BA21,($AV21:$BE21),0)<=5,BA21,\" \"),\" \"))","v":" "},{"$f":"IF(BB21=\" \",\" \",IF(Input!$G25=\"Girl\",IF(RANK(BB21,($AV21:$BE21),0)<=5,BB21,\" \"),\" \"))","v":" "},{"$f":"IF(BC21=\" \",\" \",IF(Input!$G25=\"Girl\",IF(RANK(BC21,($AV21:$BE21),0)<=5,BC21,\" \"),\" \"))","v":" "},{"$f":"IF(BD21=\" \",\" \",IF(Input!$G25=\"Girl\",IF(RANK(BD21,($AV21:$BE21),0)<=5,BD21,\" \"),\" \"))","v":" "},{"$f":"IF(BE21=\" \",\" \",IF(Input!$G25=\"Girl\",IF(RANK(BE21,($AV21:$BE21),0)<=5,BE21,\" \"),\" \"))","v":" "},null,"RED","RED","RED"," ","RED","RED"," "," "," "," ",null," "," "," "," "," "," "," "," "," "," ",1.5E-5,5.5000000000000002E-5,9.5000000000000005E-5,1.35E-4,1.75E-4,2.1499999999999999E-4,2.5500000000000002E-4,2.9500000000000001E-4,3.3500000000000001E-4,3.7500000000000001E-4,65.000015000000005,50.000055000000003,42.000095000000002," ",46.000174999999999,40.000214999999997," "," "," "," "," "," "," "," "," "," "," "," "," "," "," "]
[null,null,{"$f":"Input!D26","v":"Emily Axen-Blackwell"},{"$f":"Input!#REF!","v":{"$error":"#REF!"}},{"$f":"Input!E26","v":5},{"$f":"Input!F26","v":9},{"$f":"Input!G26","v":"Girl"},26,27,25,30,0,30,0,0,0,0,0,0,138,"Step 7"," "," ",138,"138-Girl-5",{"$f":"Input!D26","v":"Emily Axen-Blackwell"},{"$f":"IF(Input!E26=0,0,IF(ISNA(VLOOKUP((CONCATENATE(\"Balance Test-\",Input!H26)),points1,2,)),0,(VLOOKUP((CONCATENATE(\"Balance Test-\",Input!H26)),points1,2,))))","v":26},{"$f":"IF(Input!E26=0,0,IF(ISNA(VLOOKUP((CONCATENATE(\"Standing Long Jump-\",Input!I26)),points1,2,)),0,(VLOOKUP((CONCATENATE(\"Standing Long Jump-\",Input!I26)),points1,2,))))","v":27},{"$f":"IF(Input!E26=0,0,IF(ISNA(VLOOKUP((CONCATENATE(\"Speed Bounce-\",Input!J26)),points1,2,)),0,(VLOOKUP((CONCATENATE(\"Speed Bounce-\",Input!J26)),points1,2,))))","v":25},{"$f":"IF(Input!E26=0,0,IF(ISNA(VLOOKUP((CONCATENATE(\"Target Throw-\",Input!K26)),points1,2,)),0,(VLOOKUP((CONCATENATE(\"Target Throw-\",Input!K26)),points1,2,))))","v":30},{"$f":"IF(Input!E26=0,0,IF(Input!$C26>6,IF(ISNA(VLOOKUP((CONCATENATE(\"Overhead Heave-\",Input!L26)),points1,2,)),0,(VLOOKUP((CONCATENATE(\"Overhead Heave-\",Input!L26)),points1,2,))),0))","v":0},30,{"$f":"IF(Input!E26=0,0,IF(ISNA(VLOOKUP((CONCATENATE(\"Hi-Stepper-\",Input!M26)),points1,2,)),0,(VLOOKUP((CONCATENATE(\"Hi-Stepper-\",Input!M26)),points1,2,))))","v":30},{"$f":"IF(Input!E26=0,0,IF(ISNA(VLOOKUP((CONCATENATE(\"Chest Push-\",Input!N26)),points1,2,)),0,(VLOOKUP((CONCATENATE(\"Chest Push-\",Input!N26)),points1,2,))))","v":0},{"$f":"IF(Input!E26=0,0,IF(ISNA(VLOOKUP((CONCATENATE(\"Vertical Jump-\",Input!O26)),points1,2,)),0,(VLOOKUP((CONCATENATE(\"Vertical Jump-\",Input!O26)),points1,2,))))","v":0},{"$f":"IF(Input!E26=0,0,IF(ISNA(VLOOKUP((CONCATENATE(\"Shuttle Run-\",Input!P26)),points1,2,)),0,(VLOOKUP((CONCATENATE(\"Shuttle Run-\",Input!P26)),points1,2,))))","v":0},{"$f":"IF(Input!E26=0,0,IF(ISNA(VLOOKUP((CONCATENATE(\"Javelin Throw-\",Input!Q26)),points1,2,)),0,(VLOOKUP((CONCATENATE(\"Javelin Throw-\",Input!Q26)),points1,2,))))","v":0},{"$f":"IF(Input!E26=0,0,IF(Input!$C26>6,IF(ISNA(VLOOKUP((CONCATENATE(\"Shot-\",Input!R26)),points1,2,)),0,(VLOOKUP((CONCATENATE(\"Shot-\",Input!R26)),points1,2,))),0))","v":0},0,{"$f":"IF(Input!E26=0,0,IF(ISNA(VLOOKUP((CONCATENATE(\"Standing Triple Jump-\",Input!S26)),points1,2,)),0,(VLOOKUP((CONCATENATE(\"Standing Triple Jump-\",Input!S26)),points1,2,))))","v":0},{"$f":"IF(Input!$C26>6,COUNT(Input!H26:J26,Input!M26:P26,Input!S26,Input!X26:Y26),IF(Input!$C26<=6,COUNT(Input!H26:K26,Input!M26:Q26,Input!S26)))","v":5},{"$f":"IF(AO22>=5,(LARGE((AA22:AC22,AF22:AJ22,AM22:AN22),1))+LARGE((AA22:AC22,AF22:AJ22,AM22:AN22),2)+LARGE((AA22:AC22,AF22:AJ22,AM22:AN22),3)+LARGE((AA22:AC22,AF22:AJ22,AM22:AN22),4)+LARGE((AA22:AC22,AF22:AJ22,AM22:AN22),5),0)","v":138},{"$f":"IF(AP22=0,0,IF((Input!G26=\"Boy\")*AND(Input!C26>6),VLOOKUP(AP22,award2,3),IF((Input!G26=\"Girl\")*AND(Input!C26>6),VLOOKUP(AP22,award2,2),IF((Input!G26=\"Boy\")*AND(Input!C26<=6),VLOOKUP(AP22,award12,3),IF((Input!G26=\"Girl\")*AND(Input!C26<=6),VLOOKUP(AP22,award12,2),0)))))","v":"Step 7"},{"$f":"IF(Input!$C26>6,COUNT(Input!H26:J26,Input!M26:P26,Input!S26,Input!X26:Y26),IF(Input!$C26<=6,COUNT(Input!H26:K26,Input!M26:Q26,Input!S26)))","v":5},0,{"$f":"IF(AS22=0,0,IF((Input!G26=\"Boy\")*AND(Input!C26>6),VLOOKUP(AS22,award2,5),IF((Input!G26=\"Girl\")*AND(Input!C26>6),VLOOKUP(AS22,award2,4),IF((Input!G26=\"Boy\")*AND(Input!C26<=6),VLOOKUP(AS22,award12,5),IF((Input!G26=\"Girl\")*AND(Input!C26<=6),VLOOKUP(AS22,award12,4),0)))))","v":0},null,26.000015999999999,27.000056000000001,25.000095999999999,30.000136000000001,30.000176," "," "," "," "," ",null,{"$f":"IF(AV22=\" \",\" \",IF(Input!$G26=\"Boy\",IF(RANK(AV22,($AV22:$BE22),0)<=5,AV22,\" \"),\" \"))","v":" "},{"$f":"IF(AW22=\" \",\" \",IF(Input!$G26=\"Boy\",IF(RANK(AW22,($AV22:$BE22),0)<=5,AW22,\" \"),\" \"))","v":" "},{"$f":"IF(AX22=\" \",\" \",IF(Input!$G26=\"Boy\",IF(RANK(AX22,($AV22:$BE22),0)<=5,AX22,\" \"),\" \"))","v":" "},{"$f":"IF(AY22=\" \",\" \",IF(Input!$G26=\"Boy\",IF(RANK(AY22,($AV22:$BE22),0)<=5,AY22,\" \"),\" \"))","v":" "},{"$f":"IF(AZ22=\" \",\" \",IF(Input!$G26=\"Boy\",IF(RANK(AZ22,($AV22:$BE22),0)<=5,AZ22,\" \"),\" \"))","v":" "},{"$f":"IF(BA22=\" \",\" \",IF(Input!$G26=\"Boy\",IF(RANK(BA22,($AV22:$BE22),0)<=5,BA22,\" \"),\" \"))","v":" "},{"$f":"IF(BB22=\" \",\" \",IF(Input!$G26=\"Boy\",IF(RANK(BB22,($AV22:$BE22),0)<=5,BB22,\" \"),\" \"))","v":" "},{"$f":"IF(BC22=\" \",\" \",IF(Input!$G26=\"Boy\",IF(RANK(BC22,($AV22:$BE22),0)<=5,BC22,\" \"),\" \"))","v":" "},{"$f":"IF(BD22=\" \",\" \",IF(Input!$G26=\"Boy\",IF(RANK(BD22,($AV22:$BE22),0)<=5,BD22,\" \"),\" \"))","v":" "},{"$f":"IF(BE22=\" \",\" \",IF(Input!$G26=\"Boy\",IF(RANK(BE22,($AV22:$BE22),0)<=5,BE22,\" \"),\" \"))","v":" "},null,{"$f":"IF(AV22=\" \",\" \",IF(Input!$G26=\"Girl\",IF(RANK(AV22,($AV22:$BE22),0)<=5,AV22,\" \"),\" \"))","v":26.000015999999999},{"$f":"IF(AW22=\" \",\" \",IF(Input!$G26=\"Girl\",IF(RANK(AW22,($AV22:$BE22),0)<=5,AW22,\" \"),\" \"))","v":27.000056000000001},{"$f":"IF(AX22=\" \",\" \",IF(Input!$G26=\"Girl\",IF(RANK(AX22,($AV22:$BE22),0)<=5,AX22,\" \"),\" \"))","v":25.000095999999999},{"$f":"IF(AY22=\" \",\" \",IF(Input!$G26=\"Girl\",IF(RANK(AY22,($AV22:$BE22),0)<=5,AY22,\" \"),\" \"))","v":30.000136000000001},{"$f":"IF(AZ22=\" \",\" \",IF(Input!$G26=\"Girl\",IF(RANK(AZ22,($AV22:$BE22),0)<=5,AZ22,\" \"),\" \"))","v":30.000176},{"$f":"IF(BA22=\" \",\" \",IF(Input!$G26=\"Girl\",IF(RANK(BA22,($AV22:$BE22),0)<=5,BA22,\" \"),\" \"))","v":" "},{"$f":"IF(BB22=\" \",\" \",IF(Input!$G26=\"Girl\",IF(RANK(BB22,($AV22:$BE22),0)<=5,BB22,\" \"),\" \"))","v":" "},{"$f":"IF(BC22=\" \",\" \",IF(Input!$G26=\"Girl\",IF(RANK(BC22,($AV22:$BE22),0)<=5,BC22,\" \"),\" \"))","v":" "},{"$f":"IF(BD22=\" \",\" \",IF(Input!$G26=\"Girl\",IF(RANK(BD22,($AV22:$BE22),0)<=5,BD22,\" \"),\" \"))","v":" "},{"$f":"IF(BE22=\" \",\" \",IF(Input!$G26=\"Girl\",IF(RANK(BE22,($AV22:$BE22),0)<=5,BE22,\" \"),\" \"))","v":" "},null," "," "," "," "," "," "," "," "," "," ",null,{"$error":"#N/A"},{"$error":"#N/A"},{"$error":"#N/A"},{"$error":"#N/A"}," "," "," "," "," "," ",1.5999999999999999E-5,5.5999999999999999E-5,9.6000000000000002E-5,1.36E-4,1.76E-4,2.1599999999999999E-4,2.5599999999999999E-4,2.9599999999999998E-4,3.3599999999999998E-4,3.7599999999999998E-4," "," "," "," "," "," "," "," "," "," "," ",26.000015999999999,27.000056000000001,25.000095999999999,30.000136000000001,30.000176," "," "," "," "," "]
[null,null,{"$f":"Input!D27","v":"Alice Burhams"},{"$f":"Input!#REF!","v":{"$error":"#REF!"}},{"$f":"Input!E27","v":4},{"$f":"Input!F27","v":8},{"$f":"Input!G27","v":"Girl"},26,28,22,6,0,24,0,0,0,0,0,0,106,"Step 5"," "," ",106,"106-Girl-4",{"$f":"Input!D27","v":"Alice Burhams"},{"$f":"IF(Input!E27=0,0,IF(ISNA(VLOOKUP((CONCATENATE(\"Balance Test-\",Input!H27)),points1,2,)),0,(VLOOKUP((CONCATENATE(\"Balance Test-\",Input!H27)),points1,2,))))","v":26},{"$f":"IF(Input!E27=0,0,IF(ISNA(VLOOKUP((CONCATENATE(\"Standing Long Jump-\",Input!I27)),points1,2,)),0,(VLOOKUP((CONCATENATE(\"Standing Long Jump-\",Input!I27)),points1,2,))))","v":28},{"$f":"IF(Input!E27=0,0,IF(ISNA(VLOOKUP((CONCATENATE(\"Speed Bounce-\",Input!J27)),points1,2,)),0,(VLOOKUP((CONCATENATE(\"Speed Bounce-\",Input!J27)),points1,2,))))","v":22},{"$f":"IF(Input!E27=0,0,IF(ISNA(VLOOKUP((CONCATENATE(\"Target Throw-\",Input!K27)),points1,2,)),0,(VLOOKUP((CONCATENATE(\"Target Throw-\",Input!K27)),points1,2,))))","v":6},{"$f":"IF(Input!E27=0,0,IF(Input!$C27>6,IF(ISNA(VLOOKUP((CONCATENATE(\"Overhead Heave-\",Input!L27)),points1,2,)),0,(VLOOKUP((CONCATENATE(\"Overhead Heave-\",Input!L27)),points1,2,))),0))","v":0},6,{"$f":"IF(Input!E27=0,0,IF(ISNA(VLOOKUP((CONCATENATE(\"Hi-Stepper-\",Input!M27)),points1,2,)),0,(VLOOKUP((CONCATENATE(\"Hi-Stepper-\",Input!M27)),points1,2,))))","v":24},{"$f":"IF(Input!E27=0,0,IF(ISNA(VLOOKUP((CONCATENATE(\"Chest Push-\",Input!N27)),points1,2,)),0,(VLOOKUP((CONCATENATE(\"Chest Push-\",Input!N27)),points1,2,))))","v":0},{"$f":"IF(Input!E27=0,0,IF(ISNA(VLOOKUP((CONCATENATE(\"Vertical Jump-\",Input!O27)),points1,2,)),0,(VLOOKUP((CONCATENATE(\"Vertical Jump-\",Input!O27)),points1,2,))))","v":0},{"$f":"IF(Input!E27=0,0,IF(ISNA(VLOOKUP((CONCATENATE(\"Shuttle Run-\",Input!P27)),points1,2,)),0,(VLOOKUP((CONCATENATE(\"Shuttle Run-\",Input!P27)),points1,2,))))","v":0},{"$f":"IF(Input!E27=0,0,IF(ISNA(VLOOKUP((CONCATENATE(\"Javelin Throw-\",Input!Q27)),points1,2,)),0,(VLOOKUP((CONCATENATE(\"Javelin Throw-\",Input!Q27)),points1,2,))))","v":0},{"$f":"IF(Input!E27=0,0,IF(Input!$C27>6,IF(ISNA(VLOOKUP((CONCATENATE(\"Shot-\",Input!R27)),points1,2,)),0,(VLOOKUP((CONCATENATE(\"Shot-\",Input!R27)),points1,2,))),0))","v":0},0,{"$f":"IF(Input!E27=0,0,IF(ISNA(VLOOKUP((CONCATENATE(\"Standing Triple Jump-\",Input!S27)),points1,2,)),0,(VLOOKUP((CONCATENATE(\"Standing Triple Jump-\",Input!S27)),points1,2,))))","v":0},{"$f":"IF(Input!$C27>6,COUNT(Input!H27:J27,Input!M27:P27,Input!S27,Input!X27:Y27),IF(Input!$C27<=6,COUNT(Input!H27:K27,Input!M27:Q27,Input!S27)))","v":5},{"$f":"IF(AO23>=5,(LARGE((AA23:AC23,AF23:AJ23,AM23:AN23),1))+LARGE((AA23:AC23,AF23:AJ23,AM23:AN23),2)+LARGE((AA23:AC23,AF23:AJ23,AM23:AN23),3)+LARGE((AA23:AC23,AF23:AJ23,AM23:AN23),4)+LARGE((AA23:AC23,AF23:AJ23,AM23:AN23),5),0)","v":106},{"$f":"IF(AP23=0,0,IF((Input!G27=\"Boy\")*AND(Input!C27>6),VLOOKUP(AP23,award2,3),IF((Input!G27=\"Girl\")*AND(Input!C27>6),VLOOKUP(AP23,award2,2),IF((Input!G27=\"Boy\")*AND(Input!C27<=6),VLOOKUP(AP23,award12,3),IF((Input!G27=\"Girl\")*AND(Input!C27<=6),VLOOKUP(AP23,award12,2),0)))))","v":"Step 5"},{"$f":"IF(Input!$C27>6,COUNT(Input!H27:J27,Input!M27:P27,Input!S27,Input!X27:Y27),IF(Input!$C27<=6,COUNT(Input!H27:K27,Input!M27:Q27,Input!S27)))","v":5},0,{"$f":"IF(AS23=0,0,IF((Input!G27=\"Boy\")*AND(Input!C27>6),VLOOKUP(AS23,award2,5),IF((Input!G27=\"Girl\")*AND(Input!C27>6),VLOOKUP(AS23,award2,4),IF((Input!G27=\"Boy\")*AND(Input!C27<=6),VLOOKUP(AS23,award12,5),IF((Input!G27=\"Girl\")*AND(Input!C27<=6),VLOOKUP(AS23,award12,4),0)))))","v":0},null,26.000017,28.000057000000002,22.000097,6.0001369999999996,24.000177000000001," "," "," "," "," ",null,{"$f":"IF(AV23=\" \",\" \",IF(Input!$G27=\"Boy\",IF(RANK(AV23,($AV23:$BE23),0)<=5,AV23,\" \"),\" \"))","v":" "},{"$f":"IF(AW23=\" \",\" \",IF(Input!$G27=\"Boy\",IF(RANK(AW23,($AV23:$BE23),0)<=5,AW23,\" \"),\" \"))","v":" "},{"$f":"IF(AX23=\" \",\" \",IF(Input!$G27=\"Boy\",IF(RANK(AX23,($AV23:$BE23),0)<=5,AX23,\" \"),\" \"))","v":" "},{"$f":"IF(AY23=\" \",\" \",IF(Input!$G27=\"Boy\",IF(RANK(AY23,($AV23:$BE23),0)<=5,AY23,\" \"),\" \"))","v":" "},{"$f":"IF(AZ23=\" \",\" \",IF(Input!$G27=\"Boy\",IF(RANK(AZ23,($AV23:$BE23),0)<=5,AZ23,\" \"),\" \"))","v":" "},{"$f":"IF(BA23=\" \",\" \",IF(Input!$G27=\"Boy\",IF(RANK(BA23,($AV23:$BE23),0)<=5,BA23,\" \"),\" \"))","v":" "},{"$f":"IF(BB23=\" \",\" \",IF(Input!$G27=\"Boy\",IF(RANK(BB23,($AV23:$BE23),0)<=5,BB23,\" \"),\" \"))","v":" "},{"$f":"IF(BC23=\" \",\" \",IF(Input!$G27=\"Boy\",IF(RANK(BC23,($AV23:$BE23),0)<=5,BC23,\" \"),\" \"))","v":" "},{"$f":"IF(BD23=\" \",\" \",IF(Input!$G27=\"Boy\",IF(RANK(BD23,($AV23:$BE23),0)<=5,BD23,\" \"),\" \"))","v":" "},{"$f":"IF(BE23=\" \",\" \",IF(Input!$G27=\"Boy\",IF(RANK(BE23,($AV23:$BE23),0)<=5,BE23,\" \"),\" \"))","v":" "},null,{"$f":"IF(AV23=\" \",\" \",IF(Input!$G27=\"Girl\",IF(RANK(AV23,($AV23:$BE23),0)<=5,AV23,\" \"),\" \"))","v":26.000017},{"$f":"IF(AW23=\" \",\" \",IF(Input!$G27=\"Girl\",IF(RANK(AW23,($AV23:$BE23),0)<=5,AW23,\" \"),\" \"))","v":28.000057000000002},{"$f":"IF(AX23=\" \",\" \",IF(Input!$G27=\"Girl\",IF(RANK(AX23,($AV23:$BE23),0)<=5,AX23,\" \"),\" \"))","v":22.000097},{"$f":"IF(AY23=\" \",\" \",IF(Input!$G27=\"Girl\",IF(RANK(AY23,($AV23:$BE23),0)<=5,AY23,\" \"),\" \"))","v":6.0001369999999996},{"$f":"IF(AZ23=\" \",\" \",IF(Input!$G27=\"Girl\",IF(RANK(AZ23,($AV23:$BE23),0)<=5,AZ23,\" \"),\" \"))","v":24.000177000000001},{"$f":"IF(BA23=\" \",\" \",IF(Input!$G27=\"Girl\",IF(RANK(BA23,($AV23:$BE23),0)<=5,BA23,\" \"),\" \"))","v":" "},{"$f":"IF(BB23=\" \",\" \",IF(Input!$G27=\"Girl\",IF(RANK(BB23,($AV23:$BE23),0)<=5,BB23,\" \"),\" \"))","v":" "},{"$f":"IF(BC23=\" \",\" \",IF(Input!$G27=\"Girl\",IF(RANK(BC23,($AV23:$BE23),0)<=5,BC23,\" \"),\" \"))","v":" "},{"$f":"IF(BD23=\" \",\" \",IF(Input!$G27=\"Girl\",IF(RANK(BD23,($AV23:$BE23),0)<=5,BD23,\" \"),\" \"))","v":" "},{"$f":"IF(BE23=\" \",\" \",IF(Input!$G27=\"Girl\",IF(RANK(BE23,($AV23:$BE23),0)<=5,BE23,\" \"),\" \"))","v":" "},null," "," "," "," "," "," "," "," "," "," ",null,{"$error":"#N/A"},{"$error":"#N/A"},{"$error":"#N/A"},{"$error":"#N/A"},{"$error":"#N/A"}," "," "," "," "," ",1.7E-5,5.7000000000000003E-5,9.7E-5,1.37E-4,1.7699999999999999E-4,2.1699999999999999E-4,2.5700000000000001E-4,2.9700000000000001E-4,3.3700000000000001E-4,3.77E-4," "," "," "," "," "," "," "," "," "," "," ",26.000017,28.000057000000002,22.000097,6.0001369999999996,24.000177000000001," "," "," "," "," "]
[null,null,{"$f":"Input!D28","v":"Mukhtar Farah"},{"$f":"Input!#REF!","v":{"$error":"#REF!"}},{"$f":"Input!E28","v":7},{"$f":"Input!F28","v":11},{"$f":"Input!G28","v":"BOY"},44,44,31,0,0,27,28,0,0,0,0,0,174,"Step 8"," "," ",174,"174-BOY-7",{"$f":"Input!D28","v":"Mukhtar Farah"},{"$f":"IF(Input!E28=0,0,IF(ISNA(VLOOKUP((CONCATENATE(\"Balance Test-\",Input!H28)),points1,2,)),0,(VLOOKUP((CONCATENATE(\"Balance Test-\",Input!H28)),points1,2,))))","v":44},{"$f":"IF(Input!E28=0,0,IF(ISNA(VLOOKUP((CONCATENATE(\"Standing Long Jump-\",Input!I28)),points1,2,)),0,(VLOOKUP((CONCATENATE(\"Standing Long Jump-\",Input!I28)),points1,2,))))","v":44},{"$f":"IF(Input!E28=0,0,IF(ISNA(VLOOKUP((CONCATENATE(\"Speed Bounce-\",Input!J28)),points1,2,)),0,(VLOOKUP((CONCATENATE(\"Speed Bounce-\",Input!J28)),points1,2,))))","v":31},{"$f":"IF(Input!E28=0,0,IF(ISNA(VLOOKUP((CONCATENATE(\"Target Throw-\",Input!K28)),points1,2,)),0,(VLOOKUP((CONCATENATE(\"Target Throw-\",Input!K28)),points1,2,))))","v":0},{"$f":"IF(Input!E28=0,0,IF(Input!$C28>6,IF(ISNA(VLOOKUP((CONCATENATE(\"Overhead Heave-\",Input!L28)),points1,2,)),0,(VLOOKUP((CONCATENATE(\"Overhead Heave-\",Input!L28)),points1,2,))),0))","v":0},0,{"$f":"IF(Input!E28=0,0,IF(ISNA(VLOOKUP((CONCATENATE(\"Hi-Stepper-\",Input!M28)),points1,2,)),0,(VLOOKUP((CONCATENATE(\"Hi-Stepper-\",Input!M28)),points1,2,))))","v":27},{"$f":"IF(Input!E28=0,0,IF(ISNA(VLOOKUP((CONCATENATE(\"Chest Push-\",Input!N28)),points1,2,)),0,(VLOOKUP((CONCATENATE(\"Chest Push-\",Input!N28)),points1,2,))))","v":28},{"$f":"IF(Input!E28=0,0,IF(ISNA(VLOOKUP((CONCATENATE(\"Vertical Jump-\",Input!O28)),points1,2,)),0,(VLOOKUP((CONCATENATE(\"Vertical Jump-\",Input!O28)),points1,2,))))","v":0},{"$f":"IF(Input!E28=0,0,IF(ISNA(VLOOKUP((CONCATENATE(\"Shuttle Run-\",Input!P28)),points1,2,)),0,(VLOOKUP((CONCATENATE(\"Shuttle Run-\",Input!P28)),points1,2,))))","v":0},{"$f":"IF(Input!E28=0,0,IF(ISNA(VLOOKUP((CONCATENATE(\"Javelin Throw-\",Input!Q28)),points1,2,)),0,(VLOOKUP((CONCATENATE(\"Javelin Throw-\",Input!Q28)),points1,2,))))","v":0},{"$f":"IF(Input!E28=0,0,IF(Input!$C28>6,IF(ISNA(VLOOKUP((CONCATENATE(\"Shot-\",Input!R28)),points1,2,)),0,(VLOOKUP((CONCATENATE(\"Shot-\",Input!R28)),points1,2,))),0))","v":0},0,{"$f":"IF(Input!E28=0,0,IF(ISNA(VLOOKUP((CONCATENATE(\"Standing Triple Jump-\",Input!S28)),points1,2,)),0,(VLOOKUP((CONCATENATE(\"Standing Triple Jump-\",Input!S28)),points1,2,))))","v":0},{"$f":"IF(Input!$C28>6,COUNT(Input!H28:J28,Input!M28:P28,Input!S28,Input!X28:Y28),IF(Input!$C28<=6,COUNT(Input!H28:K28,Input!M28:Q28,Input!S28)))","v":5},{"$f":"IF(AO24>=5,(LARGE((AA24:AC24,AF24:AJ24,AM24:AN24),1))+LARGE((AA24:AC24,AF24:AJ24,AM24:AN24),2)+LARGE((AA24:AC24,AF24:AJ24,AM24:AN24),3)+LARGE((AA24:AC24,AF24:AJ24,AM24:AN24),4)+LARGE((AA24:AC24,AF24:AJ24,AM24:AN24),5),0)","v":174},{"$f":"IF(AP24=0,0,IF((Input!G28=\"Boy\")*AND(Input!C28>6),VLOOKUP(AP24,award2,3),IF((Input!G28=\"Girl\")*AND(Input!C28>6),VLOOKUP(AP24,award2,2),IF((Input!G28=\"Boy\")*AND(Input!C28<=6),VLOOKUP(AP24,award12,3),IF((Input!G28=\"Girl\")*AND(Input!C28<=6),VLOOKUP(AP24,award12,2),0)))))","v":"Step 8"},{"$f":"IF(Input!$C28>6,COUNT(Input!H28:J28,Input!M28:P28,Input!S28,Input!X28:Y28),IF(Input!$C28<=6,COUNT(Input!H28:K28,Input!M28:Q28,Input!S28)))","v":5},0,{"$f":"IF(AS24=0,0,IF((Input!G28=\"Boy\")*AND(Input!C28>6),VLOOKUP(AS24,award2,5),IF((Input!G28=\"Girl\")*AND(Input!C28>6),VLOOKUP(AS24,award2,4),IF((Input!G28=\"Boy\")*AND(Input!C28<=6),VLOOKUP(AS24,award12,5),IF((Input!G28=\"Girl\")*AND(Input!C28<=6),VLOOKUP(AS24,award12,4),0)))))","v":0},null,44.000017999999997,44.000058000000003,31.000098000000001," ",27.000177999999998,28.000218," "," "," "," ",null,{"$f":"IF(AV24=\" \",\" \",IF(Input!$G28=\"Boy\",IF(RANK(AV24,($AV24:$BE24),0)<=5,AV24,\" \"),\" \"))","v":44.000017999999997},{"$f":"IF(AW24=\" \",\" \",IF(Input!$G28=\"Boy\",IF(RANK(AW24,($AV24:$BE24),0)<=5,AW24,\" \"),\" \"))","v":44.000058000000003},{"$f":"IF(AX24=\" \",\" \",IF(Input!$G28=\"Boy\",IF(RANK(AX24,($AV24:$BE24),0)<=5,AX24,\" \"),\" \"))","v":31.000098000000001},{"$f":"IF(AY24=\" \",\" \",IF(Input!$G28=\"Boy\",IF(RANK(AY24,($AV24:$BE24),0)<=5,AY24,\" \"),\" \"))","v":" "},{"$f":"IF(AZ24=\" \",\" \",IF(Input!$G28=\"Boy\",IF(RANK(AZ24,($AV24:$BE24),0)<=5,AZ24,\" \"),\" \"))","v":27.000177999999998},{"$f":"IF(BA24=\" \",\" \",IF(Input!$G28=\"Boy\",IF(RANK(BA24,($AV24:$BE24),0)<=5,BA24,\" \"),\" \"))","v":28.000218},{"$f":"IF(BB24=\" \",\" \",IF(Input!$G28=\"Boy\",IF(RANK(BB24,($AV24:$BE24),0)<=5,BB24,\" \"),\" \"))","v":" "},{"$f":"IF(BC24=\" \",\" \",IF(Input!$G28=\"Boy\",IF(RANK(BC24,($AV24:$BE24),0)<=5,BC24,\" \"),\" \"))","v":" "},{"$f":"IF(BD24=\" \",\" \",IF(Input!$G28=\"Boy\",IF(RANK(BD24,($AV24:$BE24),0)<=5,BD24,\" \"),\" \"))","v":" "},{"$f":"IF(BE24=\" \",\" \",IF(Input!$G28=\"Boy\",IF(RANK(BE24,($AV24:$BE24),0)<=5,BE24,\" \"),\" \"))","v":" "},null,{"$f":"IF(AV24=\" \",\" \",IF(Input!$G28=\"Girl\",IF(RANK(AV24,($AV24:$BE24),0)<=5,AV24,\" \"),\" \"))","v":" "},{"$f":"IF(AW24=\" \",\" \",IF(Input!$G28=\"Girl\",IF(RANK(AW24,($AV24:$BE24),0)<=5,AW24,\" \"),\" \"))","v":" "},{"$f":"IF(AX24=\" \",\" \",IF(Input!$G28=\"Girl\",IF(RANK(AX24,($AV24:$BE24),0)<=5,AX24,\" \"),\" \"))","v":" "},{"$f":"IF(AY24=\" \",\" \",IF(Input!$G28=\"Girl\",IF(RANK(AY24,($AV24:$BE24),0)<=5,AY24,\" \"),\" \"))","v":" "},{"$f":"IF(AZ24=\" \",\" \",IF(Input!$G28=\"Girl\",IF(RANK(AZ24,($AV24:$BE24),0)<=5,AZ24,\" \"),\" \"))","v":" "},{"$f":"IF(BA24=\" \",\" \",IF(Input!$G28=\"Girl\",IF(RANK(BA24,($AV24:$BE24),0)<=5,BA24,\" \"),\" \"))","v":" "},{"$f":"IF(BB24=\" \",\" \",IF(Input!$G28=\"Girl\",IF(RANK(BB24,($AV24:$BE24),0)<=5,BB24,\" \"),\" \"))","v":" "},{"$f":"IF(BC24=\" \",\" \",IF(Input!$G28=\"Girl\",IF(RANK(BC24,($AV24:$BE24),0)<=5,BC24,\" \"),\" \"))","v":" "},{"$f":"IF(BD24=\" \",\" \",IF(Input!$G28=\"Girl\",IF(RANK(BD24,($AV24:$BE24),0)<=5,BD24,\" \"),\" \"))","v":" "},{"$f":"IF(BE24=\" \",\" \",IF(Input!$G28=\"Girl\",IF(RANK(BE24,($AV24:$BE24),0)<=5,BE24,\" \"),\" \"))","v":" "},null,{"$error":"#N/A"},"RED"," "," ",{"$error":"#N/A"}," "," "," "," "," ",null," "," "," "," "," "," "," "," "," "," ",1.8E-5,5.8E-5,9.7999999999999997E-5,1.3799999999999999E-4,1.7799999999999999E-4,2.1800000000000001E-4,2.5799999999999998E-4,2.9799999999999998E-4,3.3799999999999998E-4,3.7800000000000003E-4,44.000017999999997,44.000058000000003,31.000098000000001," ",27.000177999999998,28.000218," "," "," "," "," "," "," "," "," "," "," "," "," "," "," "]
[null,null,{"$f":"Input!D29","v":"Fenya Treece"},{"$f":"Input!#REF!","v":{"$error":"#REF!"}},{"$f":"Input!E29","v":3},{"$f":"Input!F29","v":7},{"$f":"Input!G29","v":"GIRL"},24,22,12,18,0,17,0,0,0,0,0,0,93,"Step 4"," "," ",93,"93-GIRL-3",{"$f":"Input!D29","v":"Fenya Treece"},{"$f":"IF(Input!E29=0,0,IF(ISNA(VLOOKUP((CONCATENATE(\"Balance Test-\",Input!H29)),points1,2,)),0,(VLOOKUP((CONCATENATE(\"Balance Test-\",Input!H29)),points1,2,))))","v":24},{"$f":"IF(Input!E29=0,0,IF(ISNA(VLOOKUP((CONCATENATE(\"Standing Long Jump-\",Input!I29)),points1,2,)),0,(VLOOKUP((CONCATENATE(\"Standing Long Jump-\",Input!I29)),points1,2,))))","v":22},{"$f":"IF(Input!E29=0,0,IF(ISNA(VLOOKUP((CONCATENATE(\"Speed Bounce-\",Input!J29)),points1,2,)),0,(VLOOKUP((CONCATENATE(\"Speed Bounce-\",Input!J29)),points1,2,))))","v":12},{"$f":"IF(Input!E29=0,0,IF(ISNA(VLOOKUP((CONCATENATE(\"Target Throw-\",Input!K29)),points1,2,)),0,(VLOOKUP((CONCATENATE(\"Target Throw-\",Input!K29)),points1,2,))))","v":18},{"$f":"IF(Input!E29=0,0,IF(Input!$C29>6,IF(ISNA(VLOOKUP((CONCATENATE(\"Overhead Heave-\",Input!L29)),points1,2,)),0,(VLOOKUP((CONCATENATE(\"Overhead Heave-\",Input!L29)),points1,2,))),0))","v":0},18,{"$f":"IF(Input!E29=0,0,IF(ISNA(VLOOKUP((CONCATENATE(\"Hi-Stepper-\",Input!M29)),points1,2,)),0,(VLOOKUP((CONCATENATE(\"Hi-Stepper-\",Input!M29)),points1,2,))))","v":17},{"$f":"IF(Input!E29=0,0,IF(ISNA(VLOOKUP((CONCATENATE(\"Chest Push-\",Input!N29)),points1,2,)),0,(VLOOKUP((CONCATENATE(\"Chest Push-\",Input!N29)),points1,2,))))","v":0},{"$f":"IF(Input!E29=0,0,IF(ISNA(VLOOKUP((CONCATENATE(\"Vertical Jump-\",Input!O29)),points1,2,)),0,(VLOOKUP((CONCATENATE(\"Vertical Jump-\",Input!O29)),points1,2,))))","v":0},{"$f":"IF(Input!E29=0,0,IF(ISNA(VLOOKUP((CONCATENATE(\"Shuttle Run-\",Input!P29)),points1,2,)),0,(VLOOKUP((CONCATENATE(\"Shuttle Run-\",Input!P29)),points1,2,))))","v":0},{"$f":"IF(Input!E29=0,0,IF(ISNA(VLOOKUP((CONCATENATE(\"Javelin Throw-\",Input!Q29)),points1,2,)),0,(VLOOKUP((CONCATENATE(\"Javelin Throw-\",Input!Q29)),points1,2,))))","v":0},{"$f":"IF(Input!E29=0,0,IF(Input!$C29>6,IF(ISNA(VLOOKUP((CONCATENATE(\"Shot-\",Input!R29)),points1,2,)),0,(VLOOKUP((CONCATENATE(\"Shot-\",Input!R29)),points1,2,))),0))","v":0},0,{"$f":"IF(Input!E29=0,0,IF(ISNA(VLOOKUP((CONCATENATE(\"Standing Triple Jump-\",Input!S29)),points1,2,)),0,(VLOOKUP((CONCATENATE(\"Standing Triple Jump-\",Input!S29)),points1,2,))))","v":0},{"$f":"IF(Input!$C29>6,COUNT(Input!H29:J29,Input!M29:P29,Input!S29,Input!X29:Y29),IF(Input!$C29<=6,COUNT(Input!H29:K29,Input!M29:Q29,Input!S29)))","v":5},{"$f":"IF(AO25>=5,(LARGE((AA25:AC25,AF25:AJ25,AM25:AN25),1))+LARGE((AA25:AC25,AF25:AJ25,AM25:AN25),2)+LARGE((AA25:AC25,AF25:AJ25,AM25:AN25),3)+LARGE((AA25:AC25,AF25:AJ25,AM25:AN25),4)+LARGE((AA25:AC25,AF25:AJ25,AM25:AN25),5),0)","v":93},{"$f":"IF(AP25=0,0,IF((Input!G29=\"Boy\")*AND(Input!C29>6),VLOOKUP(AP25,award2,3),IF((Input!G29=\"Girl\")*AND(Input!C29>6),VLOOKUP(AP25,award2,2),IF((Input!G29=\"Boy\")*AND(Input!C29<=6),VLOOKUP(AP25,award12,3),IF((Input!G29=\"Girl\")*AND(Input!C29<=6),VLOOKUP(AP25,award12,2),0)))))","v":"Step 4"},{"$f":"IF(Input!$C29>6,COUNT(Input!H29:J29,Input!M29:P29,Input!S29,Input!X29:Y29),IF(Input!$C29<=6,COUNT(Input!H29:K29,Input!M29:Q29,Input!S29)))","v":5},0,{"$f":"IF(AS25=0,0,IF((Input!G29=\"Boy\")*AND(Input!C29>6),VLOOKUP(AS25,award2,5),IF((Input!G29=\"Girl\")*AND(Input!C29>6),VLOOKUP(AS25,award2,4),IF((Input!G29=\"Boy\")*AND(Input!C29<=6),VLOOKUP(AS25,award12,5),IF((Input!G29=\"Girl\")*AND(Input!C29<=6),VLOOKUP(AS25,award12,4),0)))))","v":0},null,24.000019000000002,22.000059,12.000099000000001,18.000139000000001,17.000178999999999," "," "," "," "," ",null,{"$f":"IF(AV25=\" \",\" \",IF(Input!$G29=\"Boy\",IF(RANK(AV25,($AV25:$BE25),0)<=5,AV25,\" \"),\" \"))","v":" "},{"$f":"IF(AW25=\" \",\" \",IF(Input!$G29=\"Boy\",IF(RANK(AW25,($AV25:$BE25),0)<=5,AW25,\" \"),\" \"))","v":" "},{"$f":"IF(AX25=\" \",\" \",IF(Input!$G29=\"Boy\",IF(RANK(AX25,($AV25:$BE25),0)<=5,AX25,\" \"),\" \"))","v":" "},{"$f":"IF(AY25=\" \",\" \",IF(Input!$G29=\"Boy\",IF(RANK(AY25,($AV25:$BE25),0)<=5,AY25,\" \"),\" \"))","v":" "},{"$f":"IF(AZ25=\" \",\" \",IF(Input!$G29=\"Boy\",IF(RANK(AZ25,($AV25:$BE25),0)<=5,AZ25,\" \"),\" \"))","v":" "},{"$f":"IF(BA25=\" \",\" \",IF(Input!$G29=\"Boy\",IF(RANK(BA25,($AV25:$BE25),0)<=5,BA25,\" \"),\" \"))","v":" "},{"$f":"IF(BB25=\" \",\" \",IF(Input!$G29=\"Boy\",IF(RANK(BB25,($AV25:$BE25),0)<=5,BB25,\" \"),\" \"))","v":" "},{"$f":"IF(BC25=\" \",\" \",IF(Input!$G29=\"Boy\",IF(RANK(BC25,($AV25:$BE25),0)<=5,BC25,\" \"),\" \"))","v":" "},{"$f":"IF(BD25=\" \",\" \",IF(Input!$G29=\"Boy\",IF(RANK(BD25,($AV25:$BE25),0)<=5,BD25,\" \"),\" \"))","v":" "},{"$f":"IF(BE25=\" \",\" \",IF(Input!$G29=\"Boy\",IF(RANK(BE25,($AV25:$BE25),0)<=5,BE25,\" \"),\" \"))","v":" "},null,{"$f":"IF(AV25=\" \",\" \",IF(Input!$G29=\"Girl\",IF(RANK(AV25,($AV25:$BE25),0)<=5,AV25,\" \"),\" \"))","v":24.000019000000002},{"$f":"IF(AW25=\" \",\" \",IF(Input!$G29=\"Girl\",IF(RANK(AW25,($AV25:$BE25),0)<=5,AW25,\" \"),\" \"))","v":22.000059},{"$f":"IF(AX25=\" \",\" \",IF(Input!$G29=\"Girl\",IF(RANK(AX25,($AV25:$BE25),0)<=5,AX25,\" \"),\" \"))","v":12.000099000000001},{"$f":"IF(AY25=\" \",\" \",IF(Input!$G29=\"Girl\",IF(RANK(AY25,($AV25:$BE25),0)<=5,AY25,\" \"),\" \"))","v":18.000139000000001},{"$f":"IF(AZ25=\" \",\" \",IF(Input!$G29=\"Girl\",IF(RANK(AZ25,($AV25:$BE25),0)<=5,AZ25,\" \"),\" \"))","v":17.000178999999999},{"$f":"IF(BA25=\" \",\" \",IF(Input!$G29=\"Girl\",IF(RANK(BA25,($AV25:$BE25),0)<=5,BA25,\" \"),\" \"))","v":" "},{"$f":"IF(BB25=\" \",\" \",IF(Input!$G29=\"Girl\",IF(RANK(BB25,($AV25:$BE25),0)<=5,BB25,\" \"),\" \"))","v":" "},{"$f":"IF(BC25=\" \",\" \",IF(Input!$G29=\"Girl\",IF(RANK(BC25,($AV25:$BE25),0)<=5,BC25,\" \"),\" \"))","v":" "},{"$f":"IF(BD25=\" \",\" \",IF(Input!$G29=\"Girl\",IF(RANK(BD25,($AV25:$BE25),0)<=5,BD25,\" \"),\" \"))","v":" "},{"$f":"IF(BE25=\" \",\" \",IF(Input!$G29=\"Girl\",IF(RANK(BE25,($AV25:$BE25),0)<=5,BE25,\" \"),\" \"))","v":" "},null," "," "," "," "," "," "," "," "," "," ",null,{"$error":"#N/A"},{"$error":"#N/A"},{"$error":"#N/A"},{"$error":"#N/A"},{"$error":"#N/A"}," "," "," "," "," ",1.9000000000000001E-5,5.8999999999999903E-5,9.8999999999999899E-5,1.3899999999999999E-4,1.7899999999999999E-4,2.1900000000000001E-4,2.5900000000000001E-4,2.99E-4,3.39E-4,3.79E-4," "," "," "," "," "," "," "," "," "," "," ",24.000019000000002,22.000059,12.000099000000001,18.000139000000001,17.000178999999999," "," "," "," "," "]
[null,null,{"$f":"Input!D30","v":"Arlo Treece"},{"$f":"Input!#REF!","v":{"$error":"#REF!"}},{"$f":"Input!E30","v":6},{"$f":"Input!F30","v":10},{"$f":"Input!G30","v":"BOY"},65,41,33,42,0,39,0,0,0,0,0,0,220,"Bronze"," "," ",220,"220-BOY-6",{"$f":"Input!D30","v":"Arlo Treece"},{"$f":"IF(Input!E30=0,0,IF(ISNA(VLOOKUP((CONCATENATE(\"Balance Test-\",Input!H30)),points1,2,)),0,(VLOOKUP((CONCATENATE(\"Balance Test-\",Input!H30)),points1,2,))))","v":65},{"$f":"IF(Input!E30=0,0,IF(ISNA(VLOOKUP((CONCATENATE(\"Standing Long Jump-\",Input!I30)),points1,2,)),0,(VLOOKUP((CONCATENATE(\"Standing Long Jump-\",Input!I30)),points1,2,))))","v":41},{"$f":"IF(Input!E30=0,0,IF(ISNA(VLOOKUP((CONCATENATE(\"Speed Bounce-\",Input!J30)),points1,2,)),0,(VLOOKUP((CONCATENATE(\"Speed Bounce-\",Input!J30)),points1,2,))))","v":33},{"$f":"IF(Input!E30=0,0,IF(ISNA(VLOOKUP((CONCATENATE(\"Target Throw-\",Input!K30)),points1,2,)),0,(VLOOKUP((CONCATENATE(\"Target Throw-\",Input!K30)),points1,2,))))","v":42},{"$f":"IF(Input!E30=0,0,IF(Input!$C30>6,IF(ISNA(VLOOKUP((CONCATENATE(\"Overhead Heave-\",Input!L30)),points1,2,)),0,(VLOOKUP((CONCATENATE(\"Overhead Heave-\",Input!L30)),points1,2,))),0))","v":0},42,{"$f":"IF(Input!E30=0,0,IF(ISNA(VLOOKUP((CONCATENATE(\"Hi-Stepper-\",Input!M30)),points1,2,)),0,(VLOOKUP((CONCATENATE(\"Hi-Stepper-\",Input!M30)),points1,2,))))","v":39},{"$f":"IF(Input!E30=0,0,IF(ISNA(VLOOKUP((CONCATENATE(\"Chest Push-\",Input!N30)),points1,2,)),0,(VLOOKUP((CONCATENATE(\"Chest Push-\",Input!N30)),points1,2,))))","v":0},{"$f":"IF(Input!E30=0,0,IF(ISNA(VLOOKUP((CONCATENATE(\"Vertical Jump-\",Input!O30)),points1,2,)),0,(VLOOKUP((CONCATENATE(\"Vertical Jump-\",Input!O30)),points1,2,))))","v":0},{"$f":"IF(Input!E30=0,0,IF(ISNA(VLOOKUP((CONCATENATE(\"Shuttle Run-\",Input!P30)),points1,2,)),0,(VLOOKUP((CONCATENATE(\"Shuttle Run-\",Input!P30)),points1,2,))))","v":0},{"$f":"IF(Input!E30=0,0,IF(ISNA(VLOOKUP((CONCATENATE(\"Javelin Throw-\",Input!Q30)),points1,2,)),0,(VLOOKUP((CONCATENATE(\"Javelin Throw-\",Input!Q30)),points1,2,))))","v":0},{"$f":"IF(Input!E30=0,0,IF(Input!$C30>6,IF(ISNA(VLOOKUP((CONCATENATE(\"Shot-\",Input!R30)),points1,2,)),0,(VLOOKUP((CONCATENATE(\"Shot-\",Input!R30)),points1,2,))),0))","v":0},0,{"$f":"IF(Input!E30=0,0,IF(ISNA(VLOOKUP((CONCATENATE(\"Standing Triple Jump-\",Input!S30)),points1,2,)),0,(VLOOKUP((CONCATENATE(\"Standing Triple Jump-\",Input!S30)),points1,2,))))","v":0},{"$f":"IF(Input!$C30>6,COUNT(Input!H30:J30,Input!M30:P30,Input!S30,Input!X30:Y30),IF(Input!$C30<=6,COUNT(Input!H30:K30,Input!M30:Q30,Input!S30)))","v":5},{"$f":"IF(AO26>=5,(LARGE((AA26:AC26,AF26:AJ26,AM26:AN26),1))+LARGE((AA26:AC26,AF26:AJ26,AM26:AN26),2)+LARGE((AA26:AC26,AF26:AJ26,AM26:AN26),3)+LARGE((AA26:AC26,AF26:AJ26,AM26:AN26),4)+LARGE((AA26:AC26,AF26:AJ26,AM26:AN26),5),0)","v":220},{"$f":"IF(AP26=0,0,IF((Input!G30=\"Boy\")*AND(Input!C30>6),VLOOKUP(AP26,award2,3),IF((Input!G30=\"Girl\")*AND(Input!C30>6),VLOOKUP(AP26,award2,2),IF((Input!G30=\"Boy\")*AND(Input!C30<=6),VLOOKUP(AP26,award12,3),IF((Input!G30=\"Girl\")*AND(Input!C30<=6),VLOOKUP(AP26,award12,2),0)))))","v":"Bronze"},{"$f":"IF(Input!$C30>6,COUNT(Input!H30:J30,Input!M30:P30,Input!S30,Input!X30:Y30),IF(Input!$C30<=6,COUNT(Input!H30:K30,Input!M30:Q30,Input!S30)))","v":5},0,{"$f":"IF(AS26=0,0,IF((Input!G30=\"Boy\")*AND(Input!C30>6),VLOOKUP(AS26,award2,5),IF((Input!G30=\"Girl\")*AND(Input!C30>6),VLOOKUP(AS26,award2,4),IF((Input!G30=\"Boy\")*AND(Input!C30<=6),VLOOKUP(AS26,award12,5),IF((Input!G30=\"Girl\")*AND(Input!C30<=6),VLOOKUP(AS26,award12,4),0)))))","v":0},null,65.000020000000006,41.000059999999998,33.000100000000003,42.000140000000002,39.00018," "," "," "," "," ",null,{"$f":"IF(AV26=\" \",\" \",IF(Input!$G30=\"Boy\",IF(RANK(AV26,($AV26:$BE26),0)<=5,AV26,\" \"),\" \"))","v":65.000020000000006},{"$f":"IF(AW26=\" \",\" \",IF(Input!$G30=\"Boy\",IF(RANK(AW26,($AV26:$BE26),0)<=5,AW26,\" \"),\" \"))","v":41.000059999999998},{"$f":"IF(AX26=\" \",\" \",IF(Input!$G30=\"Boy\",IF(RANK(AX26,($AV26:$BE26),0)<=5,AX26,\" \"),\" \"))","v":33.000100000000003},{"$f":"IF(AY26=\" \",\" \",IF(Input!$G30=\"Boy\",IF(RANK(AY26,($AV26:$BE26),0)<=5,AY26,\" \"),\" \"))","v":42.000140000000002},{"$f":"IF(AZ26=\" \",\" \",IF(Input!$G30=\"Boy\",IF(RANK(AZ26,($AV26:$BE26),0)<=5,AZ26,\" \"),\" \"))","v":39.00018},{"$f":"IF(BA26=\" \",\" \",IF(Input!$G30=\"Boy\",IF(RANK(BA26,($AV26:$BE26),0)<=5,BA26,\" \"),\" \"))","v":" "},{"$f":"IF(BB26=\" \",\" \",IF(Input!$G30=\"Boy\",IF(RANK(BB26,($AV26:$BE26),0)<=5,BB26,\" \"),\" \"))","v":" "},{"$f":"IF(BC26=\" \",\" \",IF(Input!$G30=\"Boy\",IF(RANK(BC26,($AV26:$BE26),0)<=5,BC26,\" \"),\" \"))","v":" "},{"$f":"IF(BD26=\" \",\" \",IF(Input!$G30=\"Boy\",IF(RANK(BD26,($AV26:$BE26),0)<=5,BD26,\" \"),\" \"))","v":" "},{"$f":"IF(BE26=\" \",\" \",IF(Input!$G30=\"Boy\",IF(RANK(BE26,($AV26:$BE26),0)<=5,BE26,\" \"),\" \"))","v":" "},null,{"$f":"IF(AV26=\" \",\" \",IF(Input!$G30=\"Girl\",IF(RANK(AV26,($AV26:$BE26),0)<=5,AV26,\" \"),\" \"))","v":" "},{"$f":"IF(AW26=\" \",\" \",IF(Input!$G30=\"Girl\",IF(RANK(AW26,($AV26:$BE26),0)<=5,AW26,\" \"),\" \"))","v":" "},{"$f":"IF(AX26=\" \",\" \",IF(Input!$G30=\"Girl\",IF(RANK(AX26,($AV26:$BE26),0)<=5,AX26,\" \"),\" \"))","v":" "},{"$f":"IF(AY26=\" \",\" \",IF(Input!$G30=\"Girl\",IF(RANK(AY26,($AV26:$BE26),0)<=5,AY26,\" \"),\" \"))","v":" "},{"$f":"IF(AZ26=\" \",\" \",IF(Input!$G30=\"Girl\",IF(RANK(AZ26,($AV26:$BE26),0)<=5,AZ26,\" \"),\" \"))","v":" "},{"$f":"IF(BA26=\" \",\" \",IF(Input!$G30=\"Girl\",IF(RANK(BA26,($AV26:$BE26),0)<=5,BA26,\" \"),\" \"))","v":" "},{"$f":"IF(BB26=\" \",\" \",IF(Input!$G30=\"Girl\",IF(RANK(BB26,($AV26:$BE26),0)<=5,BB26,\" \"),\" \"))","v":" "},{"$f":"IF(BC26=\" \",\" \",IF(Input!$G30=\"Girl\",IF(RANK(BC26,($AV26:$BE26),0)<=5,BC26,\" \"),\" \"))","v":" "},{"$f":"IF(BD26=\" \",\" \",IF(Input!$G30=\"Girl\",IF(RANK(BD26,($AV26:$BE26),0)<=5,BD26,\" \"),\" \"))","v":" "},{"$f":"IF(BE26=\" \",\" \",IF(Input!$G30=\"Girl\",IF(RANK(BE26,($AV26:$BE26),0)<=5,BE26,\" \"),\" \"))","v":" "},null,"RED","RED","RED","RED","RED"," "," "," "," "," ",null," "," "," "," "," "," "," "," "," "," ",2.0000000000000002E-5,5.99999999999999E-5,9.9999999999999896E-5,1.3999999999999999E-4,1.8000000000000001E-4,2.2000000000000001E-4,2.5999999999999998E-4,3.00000000000001E-4,3.40000000000001E-4,3.80000000000001E-4,65.000020000000006,41.000059999999998,33.000100000000003,42.000140000000002,39.00018," "," "," "," "," "," "," "," "," "," "," "," "," "," "," "," "]
[null,null,{"$f":"Input!D31","v":"Esa Blake"},{"$f":"Input!#REF!","v":{"$error":"#REF!"}},{"$f":"Input!E31","v":3},{"$f":"Input!F31","v":7},{"$f":"Input!G31","v":"GIRL"},36,18,12,12,0,21,0,0,0,0,0,0,99,"Step 4"," "," ",99,"99-GIRL-3",{"$f":"Input!D31","v":"Esa Blake"},{"$f":"IF(Input!E31=0,0,IF(ISNA(VLOOKUP((CONCATENATE(\"Balance Test-\",Input!H31)),points1,2,)),0,(VLOOKUP((CONCATENATE(\"Balance Test-\",Input!H31)),points1,2,))))","v":36},{"$f":"IF(Input!E31=0,0,IF(ISNA(VLOOKUP((CONCATENATE(\"Standing Long Jump-\",Input!I31)),points1,2,)),0,(VLOOKUP((CONCATENATE(\"Standing Long Jump-\",Input!I31)),points1,2,))))","v":18},{"$f":"IF(Input!E31=0,0,IF(ISNA(VLOOKUP((CONCATENATE(\"Speed Bounce-\",Input!J31)),points1,2,)),0,(VLOOKUP((CONCATENATE(\"Speed Bounce-\",Input!J31)),points1,2,))))","v":12},{"$f":"IF(Input!E31=0,0,IF(ISNA(VLOOKUP((CONCATENATE(\"Target Throw-\",Input!K31)),points1,2,)),0,(VLOOKUP((CONCATENATE(\"Target Throw-\",Input!K31)),points1,2,))))","v":12},{"$f":"IF(Input!E31=0,0,IF(Input!$C31>6,IF(ISNA(VLOOKUP((CONCATENATE(\"Overhead Heave-\",Input!L31)),points1,2,)),0,(VLOOKUP((CONCATENATE(\"Overhead Heave-\",Input!L31)),points1,2,))),0))","v":0},12,{"$f":"IF(Input!E31=0,0,IF(ISNA(VLOOKUP((CONCATENATE(\"Hi-Stepper-\",Input!M31)),points1,2,)),0,(VLOOKUP((CONCATENATE(\"Hi-Stepper-\",Input!M31)),points1,2,))))","v":21},{"$f":"IF(Input!E31=0,0,IF(ISNA(VLOOKUP((CONCATENATE(\"Chest Push-\",Input!N31)),points1,2,)),0,(VLOOKUP((CONCATENATE(\"Chest Push-\",Input!N31)),points1,2,))))","v":0},{"$f":"IF(Input!E31=0,0,IF(ISNA(VLOOKUP((CONCATENATE(\"Vertical Jump-\",Input!O31)),points1,2,)),0,(VLOOKUP((CONCATENATE(\"Vertical Jump-\",Input!O31)),points1,2,))))","v":0},{"$f":"IF(Input!E31=0,0,IF(ISNA(VLOOKUP((CONCATENATE(\"Shuttle Run-\",Input!P31)),points1,2,)),0,(VLOOKUP((CONCATENATE(\"Shuttle Run-\",Input!P31)),points1,2,))))","v":0},{"$f":"IF(Input!E31=0,0,IF(ISNA(VLOOKUP((CONCATENATE(\"Javelin Throw-\",Input!Q31)),points1,2,)),0,(VLOOKUP((CONCATENATE(\"Javelin Throw-\",Input!Q31)),points1,2,))))","v":0},{"$f":"IF(Input!E31=0,0,IF(Input!$C31>6,IF(ISNA(VLOOKUP((CONCATENATE(\"Shot-\",Input!R31)),points1,2,)),0,(VLOOKUP((CONCATENATE(\"Shot-\",Input!R31)),points1,2,))),0))","v":0},0,{"$f":"IF(Input!E31=0,0,IF(ISNA(VLOOKUP((CONCATENATE(\"Standing Triple Jump-\",Input!S31)),points1,2,)),0,(VLOOKUP((CONCATENATE(\"Standing Triple Jump-\",Input!S31)),points1,2,))))","v":0},{"$f":"IF(Input!$C31>6,COUNT(Input!H31:J31,Input!M31:P31,Input!S31,Input!X31:Y31),IF(Input!$C31<=6,COUNT(Input!H31:K31,Input!M31:Q31,Input!S31)))","v":5},{"$f":"IF(AO27>=5,(LARGE((AA27:AC27,AF27:AJ27,AM27:AN27),1))+LARGE((AA27:AC27,AF27:AJ27,AM27:AN27),2)+LARGE((AA27:AC27,AF27:AJ27,AM27:AN27),3)+LARGE((AA27:AC27,AF27:AJ27,AM27:AN27),4)+LARGE((AA27:AC27,AF27:AJ27,AM27:AN27),5),0)","v":99},{"$f":"IF(AP27=0,0,IF((Input!G31=\"Boy\")*AND(Input!C31>6),VLOOKUP(AP27,award2,3),IF((Input!G31=\"Girl\")*AND(Input!C31>6),VLOOKUP(AP27,award2,2),IF((Input!G31=\"Boy\")*AND(Input!C31<=6),VLOOKUP(AP27,award12,3),IF((Input!G31=\"Girl\")*AND(Input!C31<=6),VLOOKUP(AP27,award12,2),0)))))","v":"Step 4"},{"$f":"IF(Input!$C31>6,COUNT(Input!H31:J31,Input!M31:P31,Input!S31,Input!X31:Y31),IF(Input!$C31<=6,COUNT(Input!H31:K31,Input!M31:Q31,Input!S31)))","v":5},0,{"$f":"IF(AS27=0,0,IF((Input!G31=\"Boy\")*AND(Input!C31>6),VLOOKUP(AS27,award2,5),IF((Input!G31=\"Girl\")*AND(Input!C31>6),VLOOKUP(AS27,award2,4),IF((Input!G31=\"Boy\")*AND(Input!C31<=6),VLOOKUP(AS27,award12,5),IF((Input!G31=\"Girl\")*AND(Input!C31<=6),VLOOKUP(AS27,award12,4),0)))))","v":0},null,36.000020999999997,18.000060999999999,12.000101000000001,12.000140999999999,21.000181000000001," "," "," "," "," ",null,{"$f":"IF(AV27=\" \",\" \",IF(Input!$G31=\"Boy\",IF(RANK(AV27,($AV27:$BE27),0)<=5,AV27,\" \"),\" \"))","v":" "},{"$f":"IF(AW27=\" \",\" \",IF(Input!$G31=\"Boy\",IF(RANK(AW27,($AV27:$BE27),0)<=5,AW27,\" \"),\" \"))","v":" "},{"$f":"IF(AX27=\" \",\" \",IF(Input!$G31=\"Boy\",IF(RANK(AX27,($AV27:$BE27),0)<=5,AX27,\" \"),\" \"))","v":" "},{"$f":"IF(AY27=\" \",\" \",IF(Input!$G31=\"Boy\",IF(RANK(AY27,($AV27:$BE27),0)<=5,AY27,\" \"),\" \"))","v":" "},{"$f":"IF(AZ27=\" \",\" \",IF(Input!$G31=\"Boy\",IF(RANK(AZ27,($AV27:$BE27),0)<=5,AZ27,\" \"),\" \"))","v":" "},{"$f":"IF(BA27=\" \",\" \",IF(Input!$G31=\"Boy\",IF(RANK(BA27,($AV27:$BE27),0)<=5,BA27,\" \"),\" \"))","v":" "},{"$f":"IF(BB27=\" \",\" \",IF(Input!$G31=\"Boy\",IF(RANK(BB27,($AV27:$BE27),0)<=5,BB27,\" \"),\" \"))","v":" "},{"$f":"IF(BC27=\" \",\" \",IF(Input!$G31=\"Boy\",IF(RANK(BC27,($AV27:$BE27),0)<=5,BC27,\" \"),\" \"))","v":" "},{"$f":"IF(BD27=\" \",\" \",IF(Input!$G31=\"Boy\",IF(RANK(BD27,($AV27:$BE27),0)<=5,BD27,\" \"),\" \"))","v":" "},{"$f":"IF(BE27=\" \",\" \",IF(Input!$G31=\"Boy\",IF(RANK(BE27,($AV27:$BE27),0)<=5,BE27,\" \"),\" \"))","v":" "},null,{"$f":"IF(AV27=\" \",\" \",IF(Input!$G31=\"Girl\",IF(RANK(AV27,($AV27:$BE27),0)<=5,AV27,\" \"),\" \"))","v":36.000020999999997},{"$f":"IF(AW27=\" \",\" \",IF(Input!$G31=\"Girl\",IF(RANK(AW27,($AV27:$BE27),0)<=5,AW27,\" \"),\" \"))","v":18.000060999999999},{"$f":"IF(AX27=\" \",\" \",IF(Input!$G31=\"Girl\",IF(RANK(AX27,($AV27:$BE27),0)<=5,AX27,\" \"),\" \"))","v":12.000101000000001},{"$f":"IF(AY27=\" \",\" \",IF(Input!$G31=\"Girl\",IF(RANK(AY27,($AV27:$BE27),0)<=5,AY27,\" \"),\" \"))","v":12.000140999999999},{"$f":"IF(AZ27=\" \",\" \",IF(Input!$G31=\"Girl\",IF(RANK(AZ27,($AV27:$BE27),0)<=5,AZ27,\" \"),\" \"))","v":21.000181000000001},{"$f":"IF(BA27=\" \",\" \",IF(Input!$G31=\"Girl\",IF(RANK(BA27,($AV27:$BE27),0)<=5,BA27,\" \"),\" \"))","v":" "},{"$f":"IF(BB27=\" \",\" \",IF(Input!$G31=\"Girl\",IF(RANK(BB27,($AV27:$BE27),0)<=5,BB27,\" \"),\" \"))","v":" "},{"$f":"IF(BC27=\" \",\" \",IF(Input!$G31=\"Girl\",IF(RANK(BC27,($AV27:$BE27),0)<=5,BC27,\" \"),\" \"))","v":" "},{"$f":"IF(BD27=\" \",\" \",IF(Input!$G31=\"Girl\",IF(RANK(BD27,($AV27:$BE27),0)<=5,BD27,\" \"),\" \"))","v":" "},{"$f":"IF(BE27=\" \",\" \",IF(Input!$G31=\"Girl\",IF(RANK(BE27,($AV27:$BE27),0)<=5,BE27,\" \"),\" \"))","v":" "},null," "," "," "," "," "," "," "," "," "," ",null,{"$error":"#N/A"},{"$error":"#N/A"},{"$error":"#N/A"},{"$error":"#N/A"},{"$error":"#N/A"}," "," "," "," "," ",2.0999999999999999E-5,6.0999999999999897E-5,1.01E-4,1.4100000000000001E-4,1.8100000000000001E-4,2.2100000000000001E-4,2.61E-4,3.01E-4,3.4099999999999999E-4,3.8099999999999999E-4," "," "," "," "," "," "," "," "," "," "," ",36.000020999999997,18.000060999999999,12.000101000000001,12.000140999999999,21.000181000000001," "," "," "," "," "]
[null,null,{"$f":"Input!D32","v":"Oran Blake"},{"$f":"Input!#REF!","v":{"$error":"#REF!"}},{"$f":"Input!E32","v":4},{"$f":"Input!F32","v":8},{"$f":"Input!G32","v":"BOY"},13,21,19,24,0,17,0,0,0,0,0,0,94,"Step 4"," "," ",94,"94-BOY-4",{"$f":"Input!D32","v":"Oran Blake"},{"$f":"IF(Input!E32=0,0,IF(ISNA(VLOOKUP((CONCATENATE(\"Balance Test-\",Input!H32)),points1,2,)),0,(VLOOKUP((CONCATENATE(\"Balance Test-\",Input!H32)),points1,2,))))","v":13},{"$f":"IF(Input!E32=0,0,IF(ISNA(VLOOKUP((CONCATENATE(\"Standing Long Jump-\",Input!I32)),points1,2,)),0,(VLOOKUP((CONCATENATE(\"Standing Long Jump-\",Input!I32)),points1,2,))))","v":21},{"$f":"IF(Input!E32=0,0,IF(ISNA(VLOOKUP((CONCATENATE(\"Speed Bounce-\",Input!J32)),points1,2,)),0,(VLOOKUP((CONCATENATE(\"Speed Bounce-\",Input!J32)),points1,2,))))","v":19},{"$f":"IF(Input!E32=0,0,IF(ISNA(VLOOKUP((CONCATENATE(\"Target Throw-\",Input!K32)),points1,2,)),0,(VLOOKUP((CONCATENATE(\"Target Throw-\",Input!K32)),points1,2,))))","v":24},{"$f":"IF(Input!E32=0,0,IF(Input!$C32>6,IF(ISNA(VLOOKUP((CONCATENATE(\"Overhead Heave-\",Input!L32)),points1,2,)),0,(VLOOKUP((CONCATENATE(\"Overhead Heave-\",Input!L32)),points1,2,))),0))","v":0},24,{"$f":"IF(Input!E32=0,0,IF(ISNA(VLOOKUP((CONCATENATE(\"Hi-Stepper-\",Input!M32)),points1,2,)),0,(VLOOKUP((CONCATENATE(\"Hi-Stepper-\",Input!M32)),points1,2,))))","v":17},{"$f":"IF(Input!E32=0,0,IF(ISNA(VLOOKUP((CONCATENATE(\"Chest Push-\",Input!N32)),points1,2,)),0,(VLOOKUP((CONCATENATE(\"Chest Push-\",Input!N32)),points1,2,))))","v":0},{"$f":"IF(Input!E32=0,0,IF(ISNA(VLOOKUP((CONCATENATE(\"Vertical Jump-\",Input!O32)),points1,2,)),0,(VLOOKUP((CONCATENATE(\"Vertical Jump-\",Input!O32)),points1,2,))))","v":0},{"$f":"IF(Input!E32=0,0,IF(ISNA(VLOOKUP((CONCATENATE(\"Shuttle Run-\",Input!P32)),points1,2,)),0,(VLOOKUP((CONCATENATE(\"Shuttle Run-\",Input!P32)),points1,2,))))","v":0},{"$f":"IF(Input!E32=0,0,IF(ISNA(VLOOKUP((CONCATENATE(\"Javelin Throw-\",Input!Q32)),points1,2,)),0,(VLOOKUP((CONCATENATE(\"Javelin Throw-\",Input!Q32)),points1,2,))))","v":0},{"$f":"IF(Input!E32=0,0,IF(Input!$C32>6,IF(ISNA(VLOOKUP((CONCATENATE(\"Shot-\",Input!R32)),points1,2,)),0,(VLOOKUP((CONCATENATE(\"Shot-\",Input!R32)),points1,2,))),0))","v":0},0,{"$f":"IF(Input!E32=0,0,IF(ISNA(VLOOKUP((CONCATENATE(\"Standing Triple Jump-\",Input!S32)),points1,2,)),0,(VLOOKUP((CONCATENATE(\"Standing Triple Jump-\",Input!S32)),points1,2,))))","v":0},{"$f":"IF(Input!$C32>6,COUNT(Input!H32:J32,Input!M32:P32,Input!S32,Input!X32:Y32),IF(Input!$C32<=6,COUNT(Input!H32:K32,Input!M32:Q32,Input!S32)))","v":5},{"$f":"IF(AO28>=5,(LARGE((AA28:AC28,AF28:AJ28,AM28:AN28),1))+LARGE((AA28:AC28,AF28:AJ28,AM28:AN28),2)+LARGE((AA28:AC28,AF28:AJ28,AM28:AN28),3)+LARGE((AA28:AC28,AF28:AJ28,AM28:AN28),4)+LARGE((AA28:AC28,AF28:AJ28,AM28:AN28),5),0)","v":94},{"$f":"IF(AP28=0,0,IF((Input!G32=\"Boy\")*AND(Input!C32>6),VLOOKUP(AP28,award2,3),IF((Input!G32=\"Girl\")*AND(Input!C32>6),VLOOKUP(AP28,award2,2),IF((Input!G32=\"Boy\")*AND(Input!C32<=6),VLOOKUP(AP28,award12,3),IF((Input!G32=\"Girl\")*AND(Input!C32<=6),VLOOKUP(AP28,award12,2),0)))))","v":"Step 4"},{"$f":"IF(Input!$C32>6,COUNT(Input!H32:J32,Input!M32:P32,Input!S32,Input!X32:Y32),IF(Input!$C32<=6,COUNT(Input!H32:K32,Input!M32:Q32,Input!S32)))","v":5},0,{"$f":"IF(AS28=0,0,IF((Input!G32=\"Boy\")*AND(Input!C32>6),VLOOKUP(AS28,award2,5),IF((Input!G32=\"Girl\")*AND(Input!C32>6),VLOOKUP(AS28,award2,4),IF((Input!G32=\"Boy\")*AND(Input!C32<=6),VLOOKUP(AS28,award12,5),IF((Input!G32=\"Girl\")*AND(Input!C32<=6),VLOOKUP(AS28,award12,4),0)))))","v":0},null,13.000022,21.000062,19.000101999999998,24.000142,17.000181999999999," "," "," "," "," ",null,{"$f":"IF(AV28=\" \",\" \",IF(Input!$G32=\"Boy\",IF(RANK(AV28,($AV28:$BE28),0)<=5,AV28,\" \"),\" \"))","v":13.000022},{"$f":"IF(AW28=\" \",\" \",IF(Input!$G32=\"Boy\",IF(RANK(AW28,($AV28:$BE28),0)<=5,AW28,\" \"),\" \"))","v":21.000062},{"$f":"IF(AX28=\" \",\" \",IF(Input!$G32=\"Boy\",IF(RANK(AX28,($AV28:$BE28),0)<=5,AX28,\" \"),\" \"))","v":19.000101999999998},{"$f":"IF(AY28=\" \",\" \",IF(Input!$G32=\"Boy\",IF(RANK(AY28,($AV28:$BE28),0)<=5,AY28,\" \"),\" \"))","v":24.000142},{"$f":"IF(AZ28=\" \",\" \",IF(Input!$G32=\"Boy\",IF(RANK(AZ28,($AV28:$BE28),0)<=5,AZ28,\" \"),\" \"))","v":17.000181999999999},{"$f":"IF(BA28=\" \",\" \",IF(Input!$G32=\"Boy\",IF(RANK(BA28,($AV28:$BE28),0)<=5,BA28,\" \"),\" \"))","v":" "},{"$f":"IF(BB28=\" \",\" \",IF(Input!$G32=\"Boy\",IF(RANK(BB28,($AV28:$BE28),0)<=5,BB28,\" \"),\" \"))","v":" "},{"$f":"IF(BC28=\" \",\" \",IF(Input!$G32=\"Boy\",IF(RANK(BC28,($AV28:$BE28),0)<=5,BC28,\" \"),\" \"))","v":" "},{"$f":"IF(BD28=\" \",\" \",IF(Input!$G32=\"Boy\",IF(RANK(BD28,($AV28:$BE28),0)<=5,BD28,\" \"),\" \"))","v":" "},{"$f":"IF(BE28=\" \",\" \",IF(Input!$G32=\"Boy\",IF(RANK(BE28,($AV28:$BE28),0)<=5,BE28,\" \"),\" \"))","v":" "},null,{"$f":"IF(AV28=\" \",\" \",IF(Input!$G32=\"Girl\",IF(RANK(AV28,($AV28:$BE28),0)<=5,AV28,\" \"),\" \"))","v":" "},{"$f":"IF(AW28=\" \",\" \",IF(Input!$G32=\"Girl\",IF(RANK(AW28,($AV28:$BE28),0)<=5,AW28,\" \"),\" \"))","v":" "},{"$f":"IF(AX28=\" \",\" \",IF(Input!$G32=\"Girl\",IF(RANK(AX28,($AV28:$BE28),0)<=5,AX28,\" \"),\" \"))","v":" "},{"$f":"IF(AY28=\" \",\" \",IF(Input!$G32=\"Girl\",IF(RANK(AY28,($AV28:$BE28),0)<=5,AY28,\" \"),\" \"))","v":" "},{"$f":"IF(AZ28=\" \",\" \",IF(Input!$G32=\"Girl\",IF(RANK(AZ28,($AV28:$BE28),0)<=5,AZ28,\" \"),\" \"))","v":" "},{"$f":"IF(BA28=\" \",\" \",IF(Input!$G32=\"Girl\",IF(RANK(BA28,($AV28:$BE28),0)<=5,BA28,\" \"),\" \"))","v":" "},{"$f":"IF(BB28=\" \",\" \",IF(Input!$G32=\"Girl\",IF(RANK(BB28,($AV28:$BE28),0)<=5,BB28,\" \"),\" \"))","v":" "},{"$f":"IF(BC28=\" \",\" \",IF(Input!$G32=\"Girl\",IF(RANK(BC28,($AV28:$BE28),0)<=5,BC28,\" \"),\" \"))","v":" "},{"$f":"IF(BD28=\" \",\" \",IF(Input!$G32=\"Girl\",IF(RANK(BD28,($AV28:$BE28),0)<=5,BD28,\" \"),\" \"))","v":" "},{"$f":"IF(BE28=\" \",\" \",IF(Input!$G32=\"Girl\",IF(RANK(BE28,($AV28:$BE28),0)<=5,BE28,\" \"),\" \"))","v":" "},null,{"$error":"#N/A"},{"$error":"#N/A"},{"$error":"#N/A"},{"$error":"#N/A"},{"$error":"#N/A"}," "," "," "," "," ",null," "," "," "," "," "," "," "," "," "," ",2.1999999999999999E-5,6.1999999999999894E-5,1.02E-4,1.4200000000000001E-4,1.8200000000000001E-4,2.22E-4,2.6200000000000003E-4,3.02000000000001E-4,3.4200000000000099E-4,3.8200000000000099E-4,13.000022,21.000062,19.000101999999998,24.000142,17.000181999999999," "," "," "," "," "," "," "," "," "," "," "," "," "," "," "," "]
[null,null,{"$f":"Input!D33","v":"Donncha Blake"},{"$f":"Input!#REF!","v":{"$error":"#REF!"}},{"$f":"Input!E33","v":6},{"$f":"Input!F33","v":10},{"$f":"Input!G33","v":"BOY"},55,27,28,48,0,27,0,0,0,0,0,0,185,"Bronze"," "," ",185,"185-BOY-6",{"$f":"Input!D33","v":"Donncha Blake"},{"$f":"IF(Input!E33=0,0,IF(ISNA(VLOOKUP((CONCATENATE(\"Balance Test-\",Input!H33)),points1,2,)),0,(VLOOKUP((CONCATENATE(\"Balance Test-\",Input!H33)),points1,2,))))","v":55},{"$f":"IF(Input!E33=0,0,IF(ISNA(VLOOKUP((CONCATENATE(\"Standing Long Jump-\",Input!I33)),points1,2,)),0,(VLOOKUP((CONCATENATE(\"Standing Long Jump-\",Input!I33)),points1,2,))))","v":27},{"$f":"IF(Input!E33=0,0,IF(ISNA(VLOOKUP((CONCATENATE(\"Speed Bounce-\",Input!J33)),points1,2,)),0,(VLOOKUP((CONCATENATE(\"Speed Bounce-\",Input!J33)),points1,2,))))","v":28},{"$f":"IF(Input!E33=0,0,IF(ISNA(VLOOKUP((CONCATENATE(\"Target Throw-\",Input!K33)),points1,2,)),0,(VLOOKUP((CONCATENATE(\"Target Throw-\",Input!K33)),points1,2,))))","v":48},{"$f":"IF(Input!E33=0,0,IF(Input!$C33>6,IF(ISNA(VLOOKUP((CONCATENATE(\"Overhead Heave-\",Input!L33)),points1,2,)),0,(VLOOKUP((CONCATENATE(\"Overhead Heave-\",Input!L33)),points1,2,))),0))","v":0},48,{"$f":"IF(Input!E33=0,0,IF(ISNA(VLOOKUP((CONCATENATE(\"Hi-Stepper-\",Input!M33)),points1,2,)),0,(VLOOKUP((CONCATENATE(\"Hi-Stepper-\",Input!M33)),points1,2,))))","v":27},{"$f":"IF(Input!E33=0,0,IF(ISNA(VLOOKUP((CONCATENATE(\"Chest Push-\",Input!N33)),points1,2,)),0,(VLOOKUP((CONCATENATE(\"Chest Push-\",Input!N33)),points1,2,))))","v":0},{"$f":"IF(Input!E33=0,0,IF(ISNA(VLOOKUP((CONCATENATE(\"Vertical Jump-\",Input!O33)),points1,2,)),0,(VLOOKUP((CONCATENATE(\"Vertical Jump-\",Input!O33)),points1,2,))))","v":0},{"$f":"IF(Input!E33=0,0,IF(ISNA(VLOOKUP((CONCATENATE(\"Shuttle Run-\",Input!P33)),points1,2,)),0,(VLOOKUP((CONCATENATE(\"Shuttle Run-\",Input!P33)),points1,2,))))","v":0},{"$f":"IF(Input!E33=0,0,IF(ISNA(VLOOKUP((CONCATENATE(\"Javelin Throw-\",Input!Q33)),points1,2,)),0,(VLOOKUP((CONCATENATE(\"Javelin Throw-\",Input!Q33)),points1,2,))))","v":0},{"$f":"IF(Input!E33=0,0,IF(Input!$C33>6,IF(ISNA(VLOOKUP((CONCATENATE(\"Shot-\",Input!R33)),points1,2,)),0,(VLOOKUP((CONCATENATE(\"Shot-\",Input!R33)),points1,2,))),0))","v":0},0,{"$f":"IF(Input!E33=0,0,IF(ISNA(VLOOKUP((CONCATENATE(\"Standing Triple Jump-\",Input!S33)),points1,2,)),0,(VLOOKUP((CONCATENATE(\"Standing Triple Jump-\",Input!S33)),points1,2,))))","v":0},{"$f":"IF(Input!$C33>6,COUNT(Input!H33:J33,Input!M33:P33,Input!S33,Input!X33:Y33),IF(Input!$C33<=6,COUNT(Input!H33:K33,Input!M33:Q33,Input!S33)))","v":5},{"$f":"IF(AO29>=5,(LARGE((AA29:AC29,AF29:AJ29,AM29:AN29),1))+LARGE((AA29:AC29,AF29:AJ29,AM29:AN29),2)+LARGE((AA29:AC29,AF29:AJ29,AM29:AN29),3)+LARGE((AA29:AC29,AF29:AJ29,AM29:AN29),4)+LARGE((AA29:AC29,AF29:AJ29,AM29:AN29),5),0)","v":185},{"$f":"IF(AP29=0,0,IF((Input!G33=\"Boy\")*AND(Input!C33>6),VLOOKUP(AP29,award2,3),IF((Input!G33=\"Girl\")*AND(Input!C33>6),VLOOKUP(AP29,award2,2),IF((Input!G33=\"Boy\")*AND(Input!C33<=6),VLOOKUP(AP29,award12,3),IF((Input!G33=\"Girl\")*AND(Input!C33<=6),VLOOKUP(AP29,award12,2),0)))))","v":"Bronze"},{"$f":"IF(Input!$C33>6,COUNT(Input!H33:J33,Input!M33:P33,Input!S33,Input!X33:Y33),IF(Input!$C33<=6,COUNT(Input!H33:K33,Input!M33:Q33,Input!S33)))","v":5},0,{"$f":"IF(AS29=0,0,IF((Input!G33=\"Boy\")*AND(Input!C33>6),VLOOKUP(AS29,award2,5),IF((Input!G33=\"Girl\")*AND(Input!C33>6),VLOOKUP(AS29,award2,4),IF((Input!G33=\"Boy\")*AND(Input!C33<=6),VLOOKUP(AS29,award12,5),IF((Input!G33=\"Girl\")*AND(Input!C33<=6),VLOOKUP(AS29,award12,4),0)))))","v":0},null,55.000022999999999,27.000063000000001,28.000102999999999,48.000143000000001,27.000183," "," "," "," "," ",null,{"$f":"IF(AV29=\" \",\" \",IF(Input!$G33=\"Boy\",IF(RANK(AV29,($AV29:$BE29),0)<=5,AV29,\" \"),\" \"))","v":55.000022999999999},{"$f":"IF(AW29=\" \",\" \",IF(Input!$G33=\"Boy\",IF(RANK(AW29,($AV29:$BE29),0)<=5,AW29,\" \"),\" \"))","v":27.000063000000001},{"$f":"IF(AX29=\" \",\" \",IF(Input!$G33=\"Boy\",IF(RANK(AX29,($AV29:$BE29),0)<=5,AX29,\" \"),\" \"))","v":28.000102999999999},{"$f":"IF(AY29=\" \",\" \",IF(Input!$G33=\"Boy\",IF(RANK(AY29,($AV29:$BE29),0)<=5,AY29,\" \"),\" \"))","v":48.000143000000001},{"$f":"IF(AZ29=\" \",\" \",IF(Input!$G33=\"Boy\",IF(RANK(AZ29,($AV29:$BE29),0)<=5,AZ29,\" \"),\" \"))","v":27.000183},{"$f":"IF(BA29=\" \",\" \",IF(Input!$G33=\"Boy\",IF(RANK(BA29,($AV29:$BE29),0)<=5,BA29,\" \"),\" \"))","v":" "},{"$f":"IF(BB29=\" \",\" \",IF(Input!$G33=\"Boy\",IF(RANK(BB29,($AV29:$BE29),0)<=5,BB29,\" \"),\" \"))","v":" "},{"$f":"IF(BC29=\" \",\" \",IF(Input!$G33=\"Boy\",IF(RANK(BC29,($AV29:$BE29),0)<=5,BC29,\" \"),\" \"))","v":" "},{"$f":"IF(BD29=\" \",\" \",IF(Input!$G33=\"Boy\",IF(RANK(BD29,($AV29:$BE29),0)<=5,BD29,\" \"),\" \"))","v":" "},{"$f":"IF(BE29=\" \",\" \",IF(Input!$G33=\"Boy\",IF(RANK(BE29,($AV29:$BE29),0)<=5,BE29,\" \"),\" \"))","v":" "},null,{"$f":"IF(AV29=\" \",\" \",IF(Input!$G33=\"Girl\",IF(RANK(AV29,($AV29:$BE29),0)<=5,AV29,\" \"),\" \"))","v":" "},{"$f":"IF(AW29=\" \",\" \",IF(Input!$G33=\"Girl\",IF(RANK(AW29,($AV29:$BE29),0)<=5,AW29,\" \"),\" \"))","v":" "},{"$f":"IF(AX29=\" \",\" \",IF(Input!$G33=\"Girl\",IF(RANK(AX29,($AV29:$BE29),0)<=5,AX29,\" \"),\" \"))","v":" "},{"$f":"IF(AY29=\" \",\" \",IF(Input!$G33=\"Girl\",IF(RANK(AY29,($AV29:$BE29),0)<=5,AY29,\" \"),\" \"))","v":" "},{"$f":"IF(AZ29=\" \",\" \",IF(Input!$G33=\"Girl\",IF(RANK(AZ29,($AV29:$BE29),0)<=5,AZ29,\" \"),\" \"))","v":" "},{"$f":"IF(BA29=\" \",\" \",IF(Input!$G33=\"Girl\",IF(RANK(BA29,($AV29:$BE29),0)<=5,BA29,\" \"),\" \"))","v":" "},{"$f":"IF(BB29=\" \",\" \",IF(Input!$G33=\"Girl\",IF(RANK(BB29,($AV29:$BE29),0)<=5,BB29,\" \"),\" \"))","v":" "},{"$f":"IF(BC29=\" \",\" \",IF(Input!$G33=\"Girl\",IF(RANK(BC29,($AV29:$BE29),0)<=5,BC29,\" \"),\" \"))","v":" "},{"$f":"IF(BD29=\" \",\" \",IF(Input!$G33=\"Girl\",IF(RANK(BD29,($AV29:$BE29),0)<=5,BD29,\" \"),\" \"))","v":" "},{"$f":"IF(BE29=\" \",\" \",IF(Input!$G33=\"Girl\",IF(RANK(BE29,($AV29:$BE29),0)<=5,BE29,\" \"),\" \"))","v":" "},null,{"$error":"#N/A"},{"$error":"#N/A"},{"$error":"#N/A"},"RED",{"$error":"#N/A"}," "," "," "," "," ",null," "," "," "," "," "," "," "," "," "," ",2.3E-5,6.2999999999999905E-5,1.03E-4,1.4300000000000001E-4,1.83E-4,2.23E-4,2.63E-4,3.0299999999999999E-4,3.4299999999999999E-4,3.8299999999999999E-4,55.000022999999999,27.000063000000001,28.000102999999999,48.000143000000001,27.000183," "," "," "," "," "," "," "," "," "," "," "," "," "," "," "," "]
[null,null,{"$f":"Input!D34","v":"Teagan Blake"},{"$f":"Input!#REF!","v":{"$error":"#REF!"}},{"$f":"Input!E34","v":8},{"$f":"Input!F34","v":12},{"$f":"Input!G34","v":"GIRL"},62,48,32,0,0,28,44,0,0,0,0,0,214,"Step 10"," "," ",214,"214-GIRL-8",{"$f":"Input!D34","v":"Teagan Blake"},{"$f":"IF(Input!E34=0,0,IF(ISNA(VLOOKUP((CONCATENATE(\"Balance Test-\",Input!H34)),points1,2,)),0,(VLOOKUP((CONCATENATE(\"Balance Test-\",Input!H34)),points1,2,))))","v":62},{"$f":"IF(Input!E34=0,0,IF(ISNA(VLOOKUP((CONCATENATE(\"Standing Long Jump-\",Input!I34)),points1,2,)),0,(VLOOKUP((CONCATENATE(\"Standing Long Jump-\",Input!I34)),points1,2,))))","v":48},{"$f":"IF(Input!E34=0,0,IF(ISNA(VLOOKUP((CONCATENATE(\"Speed Bounce-\",Input!J34)),points1,2,)),0,(VLOOKUP((CONCATENATE(\"Speed Bounce-\",Input!J34)),points1,2,))))","v":32},{"$f":"IF(Input!E34=0,0,IF(ISNA(VLOOKUP((CONCATENATE(\"Target Throw-\",Input!K34)),points1,2,)),0,(VLOOKUP((CONCATENATE(\"Target Throw-\",Input!K34)),points1,2,))))","v":0},{"$f":"IF(Input!E34=0,0,IF(Input!$C34>6,IF(ISNA(VLOOKUP((CONCATENATE(\"Overhead Heave-\",Input!L34)),points1,2,)),0,(VLOOKUP((CONCATENATE(\"Overhead Heave-\",Input!L34)),points1,2,))),0))","v":0},0,{"$f":"IF(Input!E34=0,0,IF(ISNA(VLOOKUP((CONCATENATE(\"Hi-Stepper-\",Input!M34)),points1,2,)),0,(VLOOKUP((CONCATENATE(\"Hi-Stepper-\",Input!M34)),points1,2,))))","v":28},{"$f":"IF(Input!E34=0,0,IF(ISNA(VLOOKUP((CONCATENATE(\"Chest Push-\",Input!N34)),points1,2,)),0,(VLOOKUP((CONCATENATE(\"Chest Push-\",Input!N34)),points1,2,))))","v":44},{"$f":"IF(Input!E34=0,0,IF(ISNA(VLOOKUP((CONCATENATE(\"Vertical Jump-\",Input!O34)),points1,2,)),0,(VLOOKUP((CONCATENATE(\"Vertical Jump-\",Input!O34)),points1,2,))))","v":0},{"$f":"IF(Input!E34=0,0,IF(ISNA(VLOOKUP((CONCATENATE(\"Shuttle Run-\",Input!P34)),points1,2,)),0,(VLOOKUP((CONCATENATE(\"Shuttle Run-\",Input!P34)),points1,2,))))","v":0},{"$f":"IF(Input!E34=0,0,IF(ISNA(VLOOKUP((CONCATENATE(\"Javelin Throw-\",Input!Q34)),points1,2,)),0,(VLOOKUP((CONCATENATE(\"Javelin Throw-\",Input!Q34)),points1,2,))))","v":0},{"$f":"IF(Input!E34=0,0,IF(Input!$C34>6,IF(ISNA(VLOOKUP((CONCATENATE(\"Shot-\",Input!R34)),points1,2,)),0,(VLOOKUP((CONCATENATE(\"Shot-\",Input!R34)),points1,2,))),0))","v":0},0,{"$f":"IF(Input!E34=0,0,IF(ISNA(VLOOKUP((CONCATENATE(\"Standing Triple Jump-\",Input!S34)),points1,2,)),0,(VLOOKUP((CONCATENATE(\"Standing Triple Jump-\",Input!S34)),points1,2,))))","v":0},{"$f":"IF(Input!$C34>6,COUNT(Input!H34:J34,Input!M34:P34,Input!S34,Input!X34:Y34),IF(Input!$C34<=6,COUNT(Input!H34:K34,Input!M34:Q34,Input!S34)))","v":5},{"$f":"IF(AO30>=5,(LARGE((AA30:AC30,AF30:AJ30,AM30:AN30),1))+LARGE((AA30:AC30,AF30:AJ30,AM30:AN30),2)+LARGE((AA30:AC30,AF30:AJ30,AM30:AN30),3)+LARGE((AA30:AC30,AF30:AJ30,AM30:AN30),4)+LARGE((AA30:AC30,AF30:AJ30,AM30:AN30),5),0)","v":214},{"$f":"IF(AP30=0,0,IF((Input!G34=\"Boy\")*AND(Input!C34>6),VLOOKUP(AP30,award2,3),IF((Input!G34=\"Girl\")*AND(Input!C34>6),VLOOKUP(AP30,award2,2),IF((Input!G34=\"Boy\")*AND(Input!C34<=6),VLOOKUP(AP30,award12,3),IF((Input!G34=\"Girl\")*AND(Input!C34<=6),VLOOKUP(AP30,award12,2),0)))))","v":"Step 10"},{"$f":"IF(Input!$C34>6,COUNT(Input!H34:J34,Input!M34:P34,Input!S34,Input!X34:Y34),IF(Input!$C34<=6,COUNT(Input!H34:K34,Input!M34:Q34,Input!S34)))","v":5},0,{"$f":"IF(AS30=0,0,IF((Input!G34=\"Boy\")*AND(Input!C34>6),VLOOKUP(AS30,award2,5),IF((Input!G34=\"Girl\")*AND(Input!C34>6),VLOOKUP(AS30,award2,4),IF((Input!G34=\"Boy\")*AND(Input!C34<=6),VLOOKUP(AS30,award12,5),IF((Input!G34=\"Girl\")*AND(Input!C34<=6),VLOOKUP(AS30,award12,4),0)))))","v":0},null,62.000024000000003,48.000064000000002,32.000104," ",28.000184000000001,44.000224000000003," "," "," "," ",null,{"$f":"IF(AV30=\" \",\" \",IF(Input!$G34=\"Boy\",IF(RANK(AV30,($AV30:$BE30),0)<=5,AV30,\" \"),\" \"))","v":" "},{"$f":"IF(AW30=\" \",\" \",IF(Input!$G34=\"Boy\",IF(RANK(AW30,($AV30:$BE30),0)<=5,AW30,\" \"),\" \"))","v":" "},{"$f":"IF(AX30=\" \",\" \",IF(Input!$G34=\"Boy\",IF(RANK(AX30,($AV30:$BE30),0)<=5,AX30,\" \"),\" \"))","v":" "},{"$f":"IF(AY30=\" \",\" \",IF(Input!$G34=\"Boy\",IF(RANK(AY30,($AV30:$BE30),0)<=5,AY30,\" \"),\" \"))","v":" "},{"$f":"IF(AZ30=\" \",\" \",IF(Input!$G34=\"Boy\",IF(RANK(AZ30,($AV30:$BE30),0)<=5,AZ30,\" \"),\" \"))","v":" "},{"$f":"IF(BA30=\" \",\" \",IF(Input!$G34=\"Boy\",IF(RANK(BA30,($AV30:$BE30),0)<=5,BA30,\" \"),\" \"))","v":" "},{"$f":"IF(BB30=\" \",\" \",IF(Input!$G34=\"Boy\",IF(RANK(BB30,($AV30:$BE30),0)<=5,BB30,\" \"),\" \"))","v":" "},{"$f":"IF(BC30=\" \",\" \",IF(Input!$G34=\"Boy\",IF(RANK(BC30,($AV30:$BE30),0)<=5,BC30,\" \"),\" \"))","v":" "},{"$f":"IF(BD30=\" \",\" \",IF(Input!$G34=\"Boy\",IF(RANK(BD30,($AV30:$BE30),0)<=5,BD30,\" \"),\" \"))","v":" "},{"$f":"IF(BE30=\" \",\" \",IF(Input!$G34=\"Boy\",IF(RANK(BE30,($AV30:$BE30),0)<=5,BE30,\" \"),\" \"))","v":" "},null,{"$f":"IF(AV30=\" \",\" \",IF(Input!$G34=\"Girl\",IF(RANK(AV30,($AV30:$BE30),0)<=5,AV30,\" \"),\" \"))","v":62.000024000000003},{"$f":"IF(AW30=\" \",\" \",IF(Input!$G34=\"Girl\",IF(RANK(AW30,($AV30:$BE30),0)<=5,AW30,\" \"),\" \"))","v":48.000064000000002},{"$f":"IF(AX30=\" \",\" \",IF(Input!$G34=\"Girl\",IF(RANK(AX30,($AV30:$BE30),0)<=5,AX30,\" \"),\" \"))","v":32.000104},{"$f":"IF(AY30=\" \",\" \",IF(Input!$G34=\"Girl\",IF(RANK(AY30,($AV30:$BE30),0)<=5,AY30,\" \"),\" \"))","v":" "},{"$f":"IF(AZ30=\" \",\" \",IF(Input!$G34=\"Girl\",IF(RANK(AZ30,($AV30:$BE30),0)<=5,AZ30,\" \"),\" \"))","v":28.000184000000001},{"$f":"IF(BA30=\" \",\" \",IF(Input!$G34=\"Girl\",IF(RANK(BA30,($AV30:$BE30),0)<=5,BA30,\" \"),\" \"))","v":44.000224000000003},{"$f":"IF(BB30=\" \",\" \",IF(Input!$G34=\"Girl\",IF(RANK(BB30,($AV30:$BE30),0)<=5,BB30,\" \"),\" \"))","v":" "},{"$f":"IF(BC30=\" \",\" \",IF(Input!$G34=\"Girl\",IF(RANK(BC30,($AV30:$BE30),0)<=5,BC30,\" \"),\" \"))","v":" "},{"$f":"IF(BD30=\" \",\" \",IF(Input!$G34=\"Girl\",IF(RANK(BD30,($AV30:$BE30),0)<=5,BD30,\" \"),\" \"))","v":" "},{"$f":"IF(BE30=\" \",\" \",IF(Input!$G34=\"Girl\",IF(RANK(BE30,($AV30:$BE30),0)<=5,BE30,\" \"),\" \"))","v":" "},null," "," "," "," "," "," "," "," "," "," ",null,{"$error":"#N/A"},"RED","RED"," ",{"$error":"#N/A"},"RED"," "," "," "," ",2.4000000000000001E-5,6.3999999999999902E-5,1.0399999999999999E-4,1.44E-4,1.84E-4,2.24E-4,2.6400000000000002E-4,3.0400000000000099E-4,3.4400000000000099E-4,3.8400000000000099E-4," "," "," "," "," "," "," "," "," "," "," ",62.000024000000003,48.000064000000002,32.000104," ",28.000184000000001,44.000224000000003," "," "," "," "]
[null,null,{"$f":"Input!D35","v":"Ruby Sanders"},{"$f":"Input!#REF!","v":{"$error":"#REF!"}},{"$f":"Input!E35","v":8},{"$f":"Input!F35","v":12},{"$f":"Input!G35","v":"GIRL"},65,49,32,0,0,40,42,0,0,0,0,0,228,"Bronze"," "," ",228,"228-GIRL-8",{"$f":"Input!D35","v":"Ruby Sanders"},{"$f":"IF(Input!E35=0,0,IF(ISNA(VLOOKUP((CONCATENATE(\"Balance Test-\",Input!H35)),points1,2,)),0,(VLOOKUP((CONCATENATE(\"Balance Test-\",Input!H35)),points1,2,))))","v":65},{"$f":"IF(Input!E35=0,0,IF(ISNA(VLOOKUP((CONCATENATE(\"Standing Long Jump-\",Input!I35)),points1,2,)),0,(VLOOKUP((CONCATENATE(\"Standing Long Jump-\",Input!I35)),points1,2,))))","v":49},{"$f":"IF(Input!E35=0,0,IF(ISNA(VLOOKUP((CONCATENATE(\"Speed Bounce-\",Input!J35)),points1,2,)),0,(VLOOKUP((CONCATENATE(\"Speed Bounce-\",Input!J35)),points1,2,))))","v":32},{"$f":"IF(Input!E35=0,0,IF(ISNA(VLOOKUP((CONCATENATE(\"Target Throw-\",Input!K35)),points1,2,)),0,(VLOOKUP((CONCATENATE(\"Target Throw-\",Input!K35)),points1,2,))))","v":0},{"$f":"IF(Input!E35=0,0,IF(Input!$C35>6,IF(ISNA(VLOOKUP((CONCATENATE(\"Overhead Heave-\",Input!L35)),points1,2,)),0,(VLOOKUP((CONCATENATE(\"Overhead Heave-\",Input!L35)),points1,2,))),0))","v":0},0,{"$f":"IF(Input!E35=0,0,IF(ISNA(VLOOKUP((CONCATENATE(\"Hi-Stepper-\",Input!M35)),points1,2,)),0,(VLOOKUP((CONCATENATE(\"Hi-Stepper-\",Input!M35)),points1,2,))))","v":40},{"$f":"IF(Input!E35=0,0,IF(ISNA(VLOOKUP((CONCATENATE(\"Chest Push-\",Input!N35)),points1,2,)),0,(VLOOKUP((CONCATENATE(\"Chest Push-\",Input!N35)),points1,2,))))","v":42},{"$f":"IF(Input!E35=0,0,IF(ISNA(VLOOKUP((CONCATENATE(\"Vertical Jump-\",Input!O35)),points1,2,)),0,(VLOOKUP((CONCATENATE(\"Vertical Jump-\",Input!O35)),points1,2,))))","v":0},{"$f":"IF(Input!E35=0,0,IF(ISNA(VLOOKUP((CONCATENATE(\"Shuttle Run-\",Input!P35)),points1,2,)),0,(VLOOKUP((CONCATENATE(\"Shuttle Run-\",Input!P35)),points1,2,))))","v":0},{"$f":"IF(Input!E35=0,0,IF(ISNA(VLOOKUP((CONCATENATE(\"Javelin Throw-\",Input!Q35)),points1,2,)),0,(VLOOKUP((CONCATENATE(\"Javelin Throw-\",Input!Q35)),points1,2,))))","v":0},{"$f":"IF(Input!E35=0,0,IF(Input!$C35>6,IF(ISNA(VLOOKUP((CONCATENATE(\"Shot-\",Input!R35)),points1,2,)),0,(VLOOKUP((CONCATENATE(\"Shot-\",Input!R35)),points1,2,))),0))","v":0},0,{"$f":"IF(Input!E35=0,0,IF(ISNA(VLOOKUP((CONCATENATE(\"Standing Triple Jump-\",Input!S35)),points1,2,)),0,(VLOOKUP((CONCATENATE(\"Standing Triple Jump-\",Input!S35)),points1,2,))))","v":0},{"$f":"IF(Input!$C35>6,COUNT(Input!H35:J35,Input!M35:P35,Input!S35,Input!X35:Y35),IF(Input!$C35<=6,COUNT(Input!H35:K35,Input!M35:Q35,Input!S35)))","v":5},{"$f":"IF(AO31>=5,(LARGE((AA31:AC31,AF31:AJ31,AM31:AN31),1))+LARGE((AA31:AC31,AF31:AJ31,AM31:AN31),2)+LARGE((AA31:AC31,AF31:AJ31,AM31:AN31),3)+LARGE((AA31:AC31,AF31:AJ31,AM31:AN31),4)+LARGE((AA31:AC31,AF31:AJ31,AM31:AN31),5),0)","v":228},{"$f":"IF(AP31=0,0,IF((Input!G35=\"Boy\")*AND(Input!C35>6),VLOOKUP(AP31,award2,3),IF((Input!G35=\"Girl\")*AND(Input!C35>6),VLOOKUP(AP31,award2,2),IF((Input!G35=\"Boy\")*AND(Input!C35<=6),VLOOKUP(AP31,award12,3),IF((Input!G35=\"Girl\")*AND(Input!C35<=6),VLOOKUP(AP31,award12,2),0)))))","v":"Bronze"},{"$f":"IF(Input!$C35>6,COUNT(Input!H35:J35,Input!M35:P35,Input!S35,Input!X35:Y35),IF(Input!$C35<=6,COUNT(Input!H35:K35,Input!M35:Q35,Input!S35)))","v":5},0,{"$f":"IF(AS31=0,0,IF((Input!G35=\"Boy\")*AND(Input!C35>6),VLOOKUP(AS31,award2,5),IF((Input!G35=\"Girl\")*AND(Input!C35>6),VLOOKUP(AS31,award2,4),IF((Input!G35=\"Boy\")*AND(Input!C35<=6),VLOOKUP(AS31,award12,5),IF((Input!G35=\"Girl\")*AND(Input!C35<=6),VLOOKUP(AS31,award12,4),0)))))","v":0},null,65.000024999999994,49.000064999999999,32.000104999999998," ",40.000185000000002,42.000225," "," "," "," ",null,{"$f":"IF(AV31=\" \",\" \",IF(Input!$G35=\"Boy\",IF(RANK(AV31,($AV31:$BE31),0)<=5,AV31,\" \"),\" \"))","v":" "},{"$f":"IF(AW31=\" \",\" \",IF(Input!$G35=\"Boy\",IF(RANK(AW31,($AV31:$BE31),0)<=5,AW31,\" \"),\" \"))","v":" "},{"$f":"IF(AX31=\" \",\" \",IF(Input!$G35=\"Boy\",IF(RANK(AX31,($AV31:$BE31),0)<=5,AX31,\" \"),\" \"))","v":" "},{"$f":"IF(AY31=\" \",\" \",IF(Input!$G35=\"Boy\",IF(RANK(AY31,($AV31:$BE31),0)<=5,AY31,\" \"),\" \"))","v":" "},{"$f":"IF(AZ31=\" \",\" \",IF(Input!$G35=\"Boy\",IF(RANK(AZ31,($AV31:$BE31),0)<=5,AZ31,\" \"),\" \"))","v":" "},{"$f":"IF(BA31=\" \",\" \",IF(Input!$G35=\"Boy\",IF(RANK(BA31,($AV31:$BE31),0)<=5,BA31,\" \"),\" \"))","v":" "},{"$f":"IF(BB31=\" \",\" \",IF(Input!$G35=\"Boy\",IF(RANK(BB31,($AV31:$BE31),0)<=5,BB31,\" \"),\" \"))","v":" "},{"$f":"IF(BC31=\" \",\" \",IF(Input!$G35=\"Boy\",IF(RANK(BC31,($AV31:$BE31),0)<=5,BC31,\" \"),\" \"))","v":" "},{"$f":"IF(BD31=\" \",\" \",IF(Input!$G35=\"Boy\",IF(RANK(BD31,($AV31:$BE31),0)<=5,BD31,\" \"),\" \"))","v":" "},{"$f":"IF(BE31=\" \",\" \",IF(Input!$G35=\"Boy\",IF(RANK(BE31,($AV31:$BE31),0)<=5,BE31,\" \"),\" \"))","v":" "},null,{"$f":"IF(AV31=\" \",\" \",IF(Input!$G35=\"Girl\",IF(RANK(AV31,($AV31:$BE31),0)<=5,AV31,\" \"),\" \"))","v":65.000024999999994},{"$f":"IF(AW31=\" \",\" \",IF(Input!$G35=\"Girl\",IF(RANK(AW31,($AV31:$BE31),0)<=5,AW31,\" \"),\" \"))","v":49.000064999999999},{"$f":"IF(AX31=\" \",\" \",IF(Input!$G35=\"Girl\",IF(RANK(AX31,($AV31:$BE31),0)<=5,AX31,\" \"),\" \"))","v":32.000104999999998},{"$f":"IF(AY31=\" \",\" \",IF(Input!$G35=\"Girl\",IF(RANK(AY31,($AV31:$BE31),0)<=5,AY31,\" \"),\" \"))","v":" "},{"$f":"IF(AZ31=\" \",\" \",IF(Input!$G35=\"Girl\",IF(RANK(AZ31,($AV31:$BE31),0)<=5,AZ31,\" \"),\" \"))","v":40.000185000000002},{"$f":"IF(BA31=\" \",\" \",IF(Input!$G35=\"Girl\",IF(RANK(BA31,($AV31:$BE31),0)<=5,BA31,\" \"),\" \"))","v":42.000225},{"$f":"IF(BB31=\" \",\" \",IF(Input!$G35=\"Girl\",IF(RANK(BB31,($AV31:$BE31),0)<=5,BB31,\" \"),\" \"))","v":" "},{"$f":"IF(BC31=\" \",\" \",IF(Input!$G35=\"Girl\",IF(RANK(BC31,($AV31:$BE31),0)<=5,BC31,\" \"),\" \"))","v":" "},{"$f":"IF(BD31=\" \",\" \",IF(Input!$G35=\"Girl\",IF(RANK(BD31,($AV31:$BE31),0)<=5,BD31,\" \"),\" \"))","v":" "},{"$f":"IF(BE31=\" \",\" \",IF(Input!$G35=\"Girl\",IF(RANK(BE31,($AV31:$BE31),0)<=5,BE31,\" \"),\" \"))","v":" "},null," "," "," "," "," "," "," "," "," "," ",null,"RED","RED","RED"," ","RED","RED"," "," "," "," ",2.5000000000000001E-5,6.4999999999999899E-5,1.05E-4,1.45E-4,1.85E-4,2.2499999999999999E-4,2.6499999999999999E-4,3.0500000000000102E-4,3.4500000000000101E-4,3.8500000000000101E-4," "," "," "," "," "," "," "," "," "," "," ",65.000024999999994,49.000064999999999,32.000104999999998," ",40.000185000000002,42.000225," "," "," "," "]
[null,null,{"$f":"Input!D36","v":"Annabelle Deards"},{"$f":"Input!#REF!","v":{"$error":"#REF!"}},{"$f":"Input!E36","v":8},{"$f":"Input!F36","v":12},{"$f":"Input!G36","v":"GIRL"},24,34,31,0,0,29,46,0,0,0,0,0,164,"Step 8"," "," ",164,"164-GIRL-8",{"$f":"Input!D36","v":"Annabelle Deards"},{"$f":"IF(Input!E36=0,0,IF(ISNA(VLOOKUP((CONCATENATE(\"Balance Test-\",Input!H36)),points1,2,)),0,(VLOOKUP((CONCATENATE(\"Balance Test-\",Input!H36)),points1,2,))))","v":24},{"$f":"IF(Input!E36=0,0,IF(ISNA(VLOOKUP((CONCATENATE(\"Standing Long Jump-\",Input!I36)),points1,2,)),0,(VLOOKUP((CONCATENATE(\"Standing Long Jump-\",Input!I36)),points1,2,))))","v":34},{"$f":"IF(Input!E36=0,0,IF(ISNA(VLOOKUP((CONCATENATE(\"Speed Bounce-\",Input!J36)),points1,2,)),0,(VLOOKUP((CONCATENATE(\"Speed Bounce-\",Input!J36)),points1,2,))))","v":31},{"$f":"IF(Input!E36=0,0,IF(ISNA(VLOOKUP((CONCATENATE(\"Target Throw-\",Input!K36)),points1,2,)),0,(VLOOKUP((CONCATENATE(\"Target Throw-\",Input!K36)),points1,2,))))","v":0},{"$f":"IF(Input!E36=0,0,IF(Input!$C36>6,IF(ISNA(VLOOKUP((CONCATENATE(\"Overhead Heave-\",Input!L36)),points1,2,)),0,(VLOOKUP((CONCATENATE(\"Overhead Heave-\",Input!L36)),points1,2,))),0))","v":0},0,{"$f":"IF(Input!E36=0,0,IF(ISNA(VLOOKUP((CONCATENATE(\"Hi-Stepper-\",Input!M36)),points1,2,)),0,(VLOOKUP((CONCATENATE(\"Hi-Stepper-\",Input!M36)),points1,2,))))","v":29},{"$f":"IF(Input!E36=0,0,IF(ISNA(VLOOKUP((CONCATENATE(\"Chest Push-\",Input!N36)),points1,2,)),0,(VLOOKUP((CONCATENATE(\"Chest Push-\",Input!N36)),points1,2,))))","v":46},{"$f":"IF(Input!E36=0,0,IF(ISNA(VLOOKUP((CONCATENATE(\"Vertical Jump-\",Input!O36)),points1,2,)),0,(VLOOKUP((CONCATENATE(\"Vertical Jump-\",Input!O36)),points1,2,))))","v":0},{"$f":"IF(Input!E36=0,0,IF(ISNA(VLOOKUP((CONCATENATE(\"Shuttle Run-\",Input!P36)),points1,2,)),0,(VLOOKUP((CONCATENATE(\"Shuttle Run-\",Input!P36)),points1,2,))))","v":0},{"$f":"IF(Input!E36=0,0,IF(ISNA(VLOOKUP((CONCATENATE(\"Javelin Throw-\",Input!Q36)),points1,2,)),0,(VLOOKUP((CONCATENATE(\"Javelin Throw-\",Input!Q36)),points1,2,))))","v":0},{"$f":"IF(Input!E36=0,0,IF(Input!$C36>6,IF(ISNA(VLOOKUP((CONCATENATE(\"Shot-\",Input!R36)),points1,2,)),0,(VLOOKUP((CONCATENATE(\"Shot-\",Input!R36)),points1,2,))),0))","v":0},0,{"$f":"IF(Input!E36=0,0,IF(ISNA(VLOOKUP((CONCATENATE(\"Standing Triple Jump-\",Input!S36)),points1,2,)),0,(VLOOKUP((CONCATENATE(\"Standing Triple Jump-\",Input!S36)),points1,2,))))","v":0},{"$f":"IF(Input!$C36>6,COUNT(Input!H36:J36,Input!M36:P36,Input!S36,Input!X36:Y36),IF(Input!$C36<=6,COUNT(Input!H36:K36,Input!M36:Q36,Input!S36)))","v":5},{"$f":"IF(AO32>=5,(LARGE((AA32:AC32,AF32:AJ32,AM32:AN32),1))+LARGE((AA32:AC32,AF32:AJ32,AM32:AN32),2)+LARGE((AA32:AC32,AF32:AJ32,AM32:AN32),3)+LARGE((AA32:AC32,AF32:AJ32,AM32:AN32),4)+LARGE((AA32:AC32,AF32:AJ32,AM32:AN32),5),0)","v":164},{"$f":"IF(AP32=0,0,IF((Input!G36=\"Boy\")*AND(Input!C36>6),VLOOKUP(AP32,award2,3),IF((Input!G36=\"Girl\")*AND(Input!C36>6),VLOOKUP(AP32,award2,2),IF((Input!G36=\"Boy\")*AND(Input!C36<=6),VLOOKUP(AP32,award12,3),IF((Input!G36=\"Girl\")*AND(Input!C36<=6),VLOOKUP(AP32,award12,2),0)))))","v":"Step 8"},{"$f":"IF(Input!$C36>6,COUNT(Input!H36:J36,Input!M36:P36,Input!S36,Input!X36:Y36),IF(Input!$C36<=6,COUNT(Input!H36:K36,Input!M36:Q36,Input!S36)))","v":5},0,{"$f":"IF(AS32=0,0,IF((Input!G36=\"Boy\")*AND(Input!C36>6),VLOOKUP(AS32,award2,5),IF((Input!G36=\"Girl\")*AND(Input!C36>6),VLOOKUP(AS32,award2,4),IF((Input!G36=\"Boy\")*AND(Input!C36<=6),VLOOKUP(AS32,award12,5),IF((Input!G36=\"Girl\")*AND(Input!C36<=6),VLOOKUP(AS32,award12,4),0)))))","v":0},null,24.000025999999998,34.000065999999997,31.000105999999999," ",29.000185999999999,46.000225999999998," "," "," "," ",null,{"$f":"IF(AV32=\" \",\" \",IF(Input!$G36=\"Boy\",IF(RANK(AV32,($AV32:$BE32),0)<=5,AV32,\" \"),\" \"))","v":" "},{"$f":"IF(AW32=\" \",\" \",IF(Input!$G36=\"Boy\",IF(RANK(AW32,($AV32:$BE32),0)<=5,AW32,\" \"),\" \"))","v":" "},{"$f":"IF(AX32=\" \",\" \",IF(Input!$G36=\"Boy\",IF(RANK(AX32,($AV32:$BE32),0)<=5,AX32,\" \"),\" \"))","v":" "},{"$f":"IF(AY32=\" \",\" \",IF(Input!$G36=\"Boy\",IF(RANK(AY32,($AV32:$BE32),0)<=5,AY32,\" \"),\" \"))","v":" "},{"$f":"IF(AZ32=\" \",\" \",IF(Input!$G36=\"Boy\",IF(RANK(AZ32,($AV32:$BE32),0)<=5,AZ32,\" \"),\" \"))","v":" "},{"$f":"IF(BA32=\" \",\" \",IF(Input!$G36=\"Boy\",IF(RANK(BA32,($AV32:$BE32),0)<=5,BA32,\" \"),\" \"))","v":" "},{"$f":"IF(BB32=\" \",\" \",IF(Input!$G36=\"Boy\",IF(RANK(BB32,($AV32:$BE32),0)<=5,BB32,\" \"),\" \"))","v":" "},{"$f":"IF(BC32=\" \",\" \",IF(Input!$G36=\"Boy\",IF(RANK(BC32,($AV32:$BE32),0)<=5,BC32,\" \"),\" \"))","v":" "},{"$f":"IF(BD32=\" \",\" \",IF(Input!$G36=\"Boy\",IF(RANK(BD32,($AV32:$BE32),0)<=5,BD32,\" \"),\" \"))","v":" "},{"$f":"IF(BE32=\" \",\" \",IF(Input!$G36=\"Boy\",IF(RANK(BE32,($AV32:$BE32),0)<=5,BE32,\" \"),\" \"))","v":" "},null,{"$f":"IF(AV32=\" \",\" \",IF(Input!$G36=\"Girl\",IF(RANK(AV32,($AV32:$BE32),0)<=5,AV32,\" \"),\" \"))","v":24.000025999999998},{"$f":"IF(AW32=\" \",\" \",IF(Input!$G36=\"Girl\",IF(RANK(AW32,($AV32:$BE32),0)<=5,AW32,\" \"),\" \"))","v":34.000065999999997},{"$f":"IF(AX32=\" \",\" \",IF(Input!$G36=\"Girl\",IF(RANK(AX32,($AV32:$BE32),0)<=5,AX32,\" \"),\" \"))","v":31.000105999999999},{"$f":"IF(AY32=\" \",\" \",IF(Input!$G36=\"Girl\",IF(RANK(AY32,($AV32:$BE32),0)<=5,AY32,\" \"),\" \"))","v":" "},{"$f":"IF(AZ32=\" \",\" \",IF(Input!$G36=\"Girl\",IF(RANK(AZ32,($AV32:$BE32),0)<=5,AZ32,\" \"),\" \"))","v":29.000185999999999},{"$f":"IF(BA32=\" \",\" \",IF(Input!$G36=\"Girl\",IF(RANK(BA32,($AV32:$BE32),0)<=5,BA32,\" \"),\" \"))","v":46.000225999999998},{"$f":"IF(BB32=\" \",\" \",IF(Input!$G36=\"Girl\",IF(RANK(BB32,($AV32:$BE32),0)<=5,BB32,\" \"),\" \"))","v":" "},{"$f":"IF(BC32=\" \",\" \",IF(Input!$G36=\"Girl\",IF(RANK(BC32,($AV32:$BE32),0)<=5,BC32,\" \"),\" \"))","v":" "},{"$f":"IF(BD32=\" \",\" \",IF(Input!$G36=\"Girl\",IF(RANK(BD32,($AV32:$BE32),0)<=5,BD32,\" \"),\" \"))","v":" "},{"$f":"IF(BE32=\" \",\" \",IF(Input!$G36=\"Girl\",IF(RANK(BE32,($AV32:$BE32),0)<=5,BE32,\" \"),\" \"))","v":" "},null," "," "," "," "," "," "," "," "," "," ",null,{"$error":"#N/A"},{"$error":"#N/A"},{"$error":"#N/A"}," "," ","RED"," "," "," "," ",2.5999999999999998E-5,6.5999999999999897E-5,1.06E-4,1.46E-4,1.8599999999999999E-4,2.2599999999999999E-4,2.6600000000000001E-4,3.0600000000000099E-4,3.4600000000000098E-4,3.8600000000000098E-4," "," "," "," "," "," "," "," "," "," "," ",24.000025999999998,34.000065999999997,31.000105999999999," ",29.000185999999999,46.000225999999998," "," "," "," "]
[null,null,{"$f":"Input!D37","v":"William Deards"},{"$f":"Input!#REF!","v":{"$error":"#REF!"}},{"$f":"Input!E37","v":3},{"$f":"Input!F37","v":8},{"$f":"Input!G37","v":"BOY"},48,18,15,30,0,24,0,0,0,0,0,0,135,"Step 7"," "," ",135,"135-BOY-3",{"$f":"Input!D37","v":"William Deards"},{"$f":"IF(Input!E37=0,0,IF(ISNA(VLOOKUP((CONCATENATE(\"Balance Test-\",Input!H37)),points1,2,)),0,(VLOOKUP((CONCATENATE(\"Balance Test-\",Input!H37)),points1,2,))))","v":48},{"$f":"IF(Input!E37=0,0,IF(ISNA(VLOOKUP((CONCATENATE(\"Standing Long Jump-\",Input!I37)),points1,2,)),0,(VLOOKUP((CONCATENATE(\"Standing Long Jump-\",Input!I37)),points1,2,))))","v":18},{"$f":"IF(Input!E37=0,0,IF(ISNA(VLOOKUP((CONCATENATE(\"Speed Bounce-\",Input!J37)),points1,2,)),0,(VLOOKUP((CONCATENATE(\"Speed Bounce-\",Input!J37)),points1,2,))))","v":15},{"$f":"IF(Input!E37=0,0,IF(ISNA(VLOOKUP((CONCATENATE(\"Target Throw-\",Input!K37)),points1,2,)),0,(VLOOKUP((CONCATENATE(\"Target Throw-\",Input!K37)),points1,2,))))","v":30},{"$f":"IF(Input!E37=0,0,IF(Input!$C37>6,IF(ISNA(VLOOKUP((CONCATENATE(\"Overhead Heave-\",Input!L37)),points1,2,)),0,(VLOOKUP((CONCATENATE(\"Overhead Heave-\",Input!L37)),points1,2,))),0))","v":0},30,{"$f":"IF(Input!E37=0,0,IF(ISNA(VLOOKUP((CONCATENATE(\"Hi-Stepper-\",Input!M37)),points1,2,)),0,(VLOOKUP((CONCATENATE(\"Hi-Stepper-\",Input!M37)),points1,2,))))","v":24},{"$f":"IF(Input!E37=0,0,IF(ISNA(VLOOKUP((CONCATENATE(\"Chest Push-\",Input!N37)),points1,2,)),0,(VLOOKUP((CONCATENATE(\"Chest Push-\",Input!N37)),points1,2,))))","v":0},{"$f":"IF(Input!E37=0,0,IF(ISNA(VLOOKUP((CONCATENATE(\"Vertical Jump-\",Input!O37)),points1,2,)),0,(VLOOKUP((CONCATENATE(\"Vertical Jump-\",Input!O37)),points1,2,))))","v":0},{"$f":"IF(Input!E37=0,0,IF(ISNA(VLOOKUP((CONCATENATE(\"Shuttle Run-\",Input!P37)),points1,2,)),0,(VLOOKUP((CONCATENATE(\"Shuttle Run-\",Input!P37)),points1,2,))))","v":0},{"$f":"IF(Input!E37=0,0,IF(ISNA(VLOOKUP((CONCATENATE(\"Javelin Throw-\",Input!Q37)),points1,2,)),0,(VLOOKUP((CONCATENATE(\"Javelin Throw-\",Input!Q37)),points1,2,))))","v":0},{"$f":"IF(Input!E37=0,0,IF(Input!$C37>6,IF(ISNA(VLOOKUP((CONCATENATE(\"Shot-\",Input!R37)),points1,2,)),0,(VLOOKUP((CONCATENATE(\"Shot-\",Input!R37)),points1,2,))),0))","v":0},0,{"$f":"IF(Input!E37=0,0,IF(ISNA(VLOOKUP((CONCATENATE(\"Standing Triple Jump-\",Input!S37)),points1,2,)),0,(VLOOKUP((CONCATENATE(\"Standing Triple Jump-\",Input!S37)),points1,2,))))","v":0},{"$f":"IF(Input!$C37>6,COUNT(Input!H37:J37,Input!M37:P37,Input!S37,Input!X37:Y37),IF(Input!$C37<=6,COUNT(Input!H37:K37,Input!M37:Q37,Input!S37)))","v":5},{"$f":"IF(AO33>=5,(LARGE((AA33:AC33,AF33:AJ33,AM33:AN33),1))+LARGE((AA33:AC33,AF33:AJ33,AM33:AN33),2)+LARGE((AA33:AC33,AF33:AJ33,AM33:AN33),3)+LARGE((AA33:AC33,AF33:AJ33,AM33:AN33),4)+LARGE((AA33:AC33,AF33:AJ33,AM33:AN33),5),0)","v":135},{"$f":"IF(AP33=0,0,IF((Input!G37=\"Boy\")*AND(Input!C37>6),VLOOKUP(AP33,award2,3),IF((Input!G37=\"Girl\")*AND(Input!C37>6),VLOOKUP(AP33,award2,2),IF((Input!G37=\"Boy\")*AND(Input!C37<=6),VLOOKUP(AP33,award12,3),IF((Input!G37=\"Girl\")*AND(Input!C37<=6),VLOOKUP(AP33,award12,2),0)))))","v":"Step 7"},{"$f":"IF(Input!$C37>6,COUNT(Input!H37:J37,Input!M37:P37,Input!S37,Input!X37:Y37),IF(Input!$C37<=6,COUNT(Input!H37:K37,Input!M37:Q37,Input!S37)))","v":5},0,{"$f":"IF(AS33=0,0,IF((Input!G37=\"Boy\")*AND(Input!C37>6),VLOOKUP(AS33,award2,5),IF((Input!G37=\"Girl\")*AND(Input!C37>6),VLOOKUP(AS33,award2,4),IF((Input!G37=\"Boy\")*AND(Input!C37<=6),VLOOKUP(AS33,award12,5),IF((Input!G37=\"Girl\")*AND(Input!C37<=6),VLOOKUP(AS33,award12,4),0)))))","v":0},null,48.000027000000003,18.000067000000001,15.000107,30.000146999999998,24.000187," "," "," "," "," ",null,{"$f":"IF(AV33=\" \",\" \",IF(Input!$G37=\"Boy\",IF(RANK(AV33,($AV33:$BE33),0)<=5,AV33,\" \"),\" \"))","v":48.000027000000003},{"$f":"IF(AW33=\" \",\" \",IF(Input!$G37=\"Boy\",IF(RANK(AW33,($AV33:$BE33),0)<=5,AW33,\" \"),\" \"))","v":18.000067000000001},{"$f":"IF(AX33=\" \",\" \",IF(Input!$G37=\"Boy\",IF(RANK(AX33,($AV33:$BE33),0)<=5,AX33,\" \"),\" \"))","v":15.000107},{"$f":"IF(AY33=\" \",\" \",IF(Input!$G37=\"Boy\",IF(RANK(AY33,($AV33:$BE33),0)<=5,AY33,\" \"),\" \"))","v":30.000146999999998},{"$f":"IF(AZ33=\" \",\" \",IF(Input!$G37=\"Boy\",IF(RANK(AZ33,($AV33:$BE33),0)<=5,AZ33,\" \"),\" \"))","v":24.000187},{"$f":"IF(BA33=\" \",\" \",IF(Input!$G37=\"Boy\",IF(RANK(BA33,($AV33:$BE33),0)<=5,BA33,\" \"),\" \"))","v":" "},{"$f":"IF(BB33=\" \",\" \",IF(Input!$G37=\"Boy\",IF(RANK(BB33,($AV33:$BE33),0)<=5,BB33,\" \"),\" \"))","v":" "},{"$f":"IF(BC33=\" \",\" \",IF(Input!$G37=\"Boy\",IF(RANK(BC33,($AV33:$BE33),0)<=5,BC33,\" \"),\" \"))","v":" "},{"$f":"IF(BD33=\" \",\" \",IF(Input!$G37=\"Boy\",IF(RANK(BD33,($AV33:$BE33),0)<=5,BD33,\" \"),\" \"))","v":" "},{"$f":"IF(BE33=\" \",\" \",IF(Input!$G37=\"Boy\",IF(RANK(BE33,($AV33:$BE33),0)<=5,BE33,\" \"),\" \"))","v":" "},null,{"$f":"IF(AV33=\" \",\" \",IF(Input!$G37=\"Girl\",IF(RANK(AV33,($AV33:$BE33),0)<=5,AV33,\" \"),\" \"))","v":" "},{"$f":"IF(AW33=\" \",\" \",IF(Input!$G37=\"Girl\",IF(RANK(AW33,($AV33:$BE33),0)<=5,AW33,\" \"),\" \"))","v":" "},{"$f":"IF(AX33=\" \",\" \",IF(Input!$G37=\"Girl\",IF(RANK(AX33,($AV33:$BE33),0)<=5,AX33,\" \"),\" \"))","v":" "},{"$f":"IF(AY33=\" \",\" \",IF(Input!$G37=\"Girl\",IF(RANK(AY33,($AV33:$BE33),0)<=5,AY33,\" \"),\" \"))","v":" "},{"$f":"IF(AZ33=\" \",\" \",IF(Input!$G37=\"Girl\",IF(RANK(AZ33,($AV33:$BE33),0)<=5,AZ33,\" \"),\" \"))","v":" "},{"$f":"IF(BA33=\" \",\" \",IF(Input!$G37=\"Girl\",IF(RANK(BA33,($AV33:$BE33),0)<=5,BA33,\" \"),\" \"))","v":" "},{"$f":"IF(BB33=\" \",\" \",IF(Input!$G37=\"Girl\",IF(RANK(BB33,($AV33:$BE33),0)<=5,BB33,\" \"),\" \"))","v":" "},{"$f":"IF(BC33=\" \",\" \",IF(Input!$G37=\"Girl\",IF(RANK(BC33,($AV33:$BE33),0)<=5,BC33,\" \"),\" \"))","v":" "},{"$f":"IF(BD33=\" \",\" \",IF(Input!$G37=\"Girl\",IF(RANK(BD33,($AV33:$BE33),0)<=5,BD33,\" \"),\" \"))","v":" "},{"$f":"IF(BE33=\" \",\" \",IF(Input!$G37=\"Girl\",IF(RANK(BE33,($AV33:$BE33),0)<=5,BE33,\" \"),\" \"))","v":" "},null,{"$error":"#N/A"},{"$error":"#N/A"},{"$error":"#N/A"},{"$error":"#N/A"},{"$error":"#N/A"}," "," "," "," "," ",null," "," "," "," "," "," "," "," "," "," ",2.6999999999999999E-5,6.6999999999999894E-5,1.07E-4,1.47E-4,1.8699999999999999E-4,2.2699999999999999E-4,2.6699999999999998E-4,3.0700000000000101E-4,3.4700000000000101E-4,3.87000000000001E-4,48.000027000000003,18.000067000000001,15.000107,30.000146999999998,24.000187," "," "," "," "," "," "," "," "," "," "," "," "," "," "," "," "]
[null,null,{"$f":"Input!D38","v":"William Blunt"},{"$f":"Input!#REF!","v":{"$error":"#REF!"}},{"$f":"Input!E38","v":2},{"$f":"Input!F38","v":6},{"$f":"Input!G38","v":"BOY"},19,14,12,6,0,18,0,0,0,0,0,0,69,"Step 3"," "," ",69,"69-BOY-2",{"$f":"Input!D38","v":"William Blunt"},{"$f":"IF(Input!E38=0,0,IF(ISNA(VLOOKUP((CONCATENATE(\"Balance Test-\",Input!H38)),points1,2,)),0,(VLOOKUP((CONCATENATE(\"Balance Test-\",Input!H38)),points1,2,))))","v":19},{"$f":"IF(Input!E38=0,0,IF(ISNA(VLOOKUP((CONCATENATE(\"Standing Long Jump-\",Input!I38)),points1,2,)),0,(VLOOKUP((CONCATENATE(\"Standing Long Jump-\",Input!I38)),points1,2,))))","v":14},{"$f":"IF(Input!E38=0,0,IF(ISNA(VLOOKUP((CONCATENATE(\"Speed Bounce-\",Input!J38)),points1,2,)),0,(VLOOKUP((CONCATENATE(\"Speed Bounce-\",Input!J38)),points1,2,))))","v":12},{"$f":"IF(Input!E38=0,0,IF(ISNA(VLOOKUP((CONCATENATE(\"Target Throw-\",Input!K38)),points1,2,)),0,(VLOOKUP((CONCATENATE(\"Target Throw-\",Input!K38)),points1,2,))))","v":6},{"$f":"IF(Input!E38=0,0,IF(Input!$C38>6,IF(ISNA(VLOOKUP((CONCATENATE(\"Overhead Heave-\",Input!L38)),points1,2,)),0,(VLOOKUP((CONCATENATE(\"Overhead Heave-\",Input!L38)),points1,2,))),0))","v":0},6,{"$f":"IF(Input!E38=0,0,IF(ISNA(VLOOKUP((CONCATENATE(\"Hi-Stepper-\",Input!M38)),points1,2,)),0,(VLOOKUP((CONCATENATE(\"Hi-Stepper-\",Input!M38)),points1,2,))))","v":18},{"$f":"IF(Input!E38=0,0,IF(ISNA(VLOOKUP((CONCATENATE(\"Chest Push-\",Input!N38)),points1,2,)),0,(VLOOKUP((CONCATENATE(\"Chest Push-\",Input!N38)),points1,2,))))","v":0},{"$f":"IF(Input!E38=0,0,IF(ISNA(VLOOKUP((CONCATENATE(\"Vertical Jump-\",Input!O38)),points1,2,)),0,(VLOOKUP((CONCATENATE(\"Vertical Jump-\",Input!O38)),points1,2,))))","v":0},{"$f":"IF(Input!E38=0,0,IF(ISNA(VLOOKUP((CONCATENATE(\"Shuttle Run-\",Input!P38)),points1,2,)),0,(VLOOKUP((CONCATENATE(\"Shuttle Run-\",Input!P38)),points1,2,))))","v":0},{"$f":"IF(Input!E38=0,0,IF(ISNA(VLOOKUP((CONCATENATE(\"Javelin Throw-\",Input!Q38)),points1,2,)),0,(VLOOKUP((CONCATENATE(\"Javelin Throw-\",Input!Q38)),points1,2,))))","v":0},{"$f":"IF(Input!E38=0,0,IF(Input!$C38>6,IF(ISNA(VLOOKUP((CONCATENATE(\"Shot-\",Input!R38)),points1,2,)),0,(VLOOKUP((CONCATENATE(\"Shot-\",Input!R38)),points1,2,))),0))","v":0},0,{"$f":"IF(Input!E38=0,0,IF(ISNA(VLOOKUP((CONCATENATE(\"Standing Triple Jump-\",Input!S38)),points1,2,)),0,(VLOOKUP((CONCATENATE(\"Standing Triple Jump-\",Input!S38)),points1,2,))))","v":0},{"$f":"IF(Input!$C38>6,COUNT(Input!H38:J38,Input!M38:P38,Input!S38,Input!X38:Y38),IF(Input!$C38<=6,COUNT(Input!H38:K38,Input!M38:Q38,Input!S38)))","v":5},{"$f":"IF(AO34>=5,(LARGE((AA34:AC34,AF34:AJ34,AM34:AN34),1))+LARGE((AA34:AC34,AF34:AJ34,AM34:AN34),2)+LARGE((AA34:AC34,AF34:AJ34,AM34:AN34),3)+LARGE((AA34:AC34,AF34:AJ34,AM34:AN34),4)+LARGE((AA34:AC34,AF34:AJ34,AM34:AN34),5),0)","v":69},{"$f":"IF(AP34=0,0,IF((Input!G38=\"Boy\")*AND(Input!C38>6),VLOOKUP(AP34,award2,3),IF((Input!G38=\"Girl\")*AND(Input!C38>6),VLOOKUP(AP34,award2,2),IF((Input!G38=\"Boy\")*AND(Input!C38<=6),VLOOKUP(AP34,award12,3),IF((Input!G38=\"Girl\")*AND(Input!C38<=6),VLOOKUP(AP34,award12,2),0)))))","v":"Step 3"},{"$f":"IF(Input!$C38>6,COUNT(Input!H38:J38,Input!M38:P38,Input!S38,Input!X38:Y38),IF(Input!$C38<=6,COUNT(Input!H38:K38,Input!M38:Q38,Input!S38)))","v":5},0,{"$f":"IF(AS34=0,0,IF((Input!G38=\"Boy\")*AND(Input!C38>6),VLOOKUP(AS34,award2,5),IF((Input!G38=\"Girl\")*AND(Input!C38>6),VLOOKUP(AS34,award2,4),IF((Input!G38=\"Boy\")*AND(Input!C38<=6),VLOOKUP(AS34,award12,5),IF((Input!G38=\"Girl\")*AND(Input!C38<=6),VLOOKUP(AS34,award12,4),0)))))","v":0},null,19.000028,14.000068000000001,12.000108000000001,6.0001480000000003,18.000188000000001," "," "," "," "," ",null,{"$f":"IF(AV34=\" \",\" \",IF(Input!$G38=\"Boy\",IF(RANK(AV34,($AV34:$BE34),0)<=5,AV34,\" \"),\" \"))","v":19.000028},{"$f":"IF(AW34=\" \",\" \",IF(Input!$G38=\"Boy\",IF(RANK(AW34,($AV34:$BE34),0)<=5,AW34,\" \"),\" \"))","v":14.000068000000001},{"$f":"IF(AX34=\" \",\" \",IF(Input!$G38=\"Boy\",IF(RANK(AX34,($AV34:$BE34),0)<=5,AX34,\" \"),\" \"))","v":12.000108000000001},{"$f":"IF(AY34=\" \",\" \",IF(Input!$G38=\"Boy\",IF(RANK(AY34,($AV34:$BE34),0)<=5,AY34,\" \"),\" \"))","v":6.0001480000000003},{"$f":"IF(AZ34=\" \",\" \",IF(Input!$G38=\"Boy\",IF(RANK(AZ34,($AV34:$BE34),0)<=5,AZ34,\" \"),\" \"))","v":18.000188000000001},{"$f":"IF(BA34=\" \",\" \",IF(Input!$G38=\"Boy\",IF(RANK(BA34,($AV34:$BE34),0)<=5,BA34,\" \"),\" \"))","v":" "},{"$f":"IF(BB34=\" \",\" \",IF(Input!$G38=\"Boy\",IF(RANK(BB34,($AV34:$BE34),0)<=5,BB34,\" \"),\" \"))","v":" "},{"$f":"IF(BC34=\" \",\" \",IF(Input!$G38=\"Boy\",IF(RANK(BC34,($AV34:$BE34),0)<=5,BC34,\" \"),\" \"))","v":" "},{"$f":"IF(BD34=\" \",\" \",IF(Input!$G38=\"Boy\",IF(RANK(BD34,($AV34:$BE34),0)<=5,BD34,\" \"),\" \"))","v":" "},{"$f":"IF(BE34=\" \",\" \",IF(Input!$G38=\"Boy\",IF(RANK(BE34,($AV34:$BE34),0)<=5,BE34,\" \"),\" \"))","v":" "},null,{"$f":"IF(AV34=\" \",\" \",IF(Input!$G38=\"Girl\",IF(RANK(AV34,($AV34:$BE34),0)<=5,AV34,\" \"),\" \"))","v":" "},{"$f":"IF(AW34=\" \",\" \",IF(Input!$G38=\"Girl\",IF(RANK(AW34,($AV34:$BE34),0)<=5,AW34,\" \"),\" \"))","v":" "},{"$f":"IF(AX34=\" \",\" \",IF(Input!$G38=\"Girl\",IF(RANK(AX34,($AV34:$BE34),0)<=5,AX34,\" \"),\" \"))","v":" "},{"$f":"IF(AY34=\" \",\" \",IF(Input!$G38=\"Girl\",IF(RANK(AY34,($AV34:$BE34),0)<=5,AY34,\" \"),\" \"))","v":" "},{"$f":"IF(AZ34=\" \",\" \",IF(Input!$G38=\"Girl\",IF(RANK(AZ34,($AV34:$BE34),0)<=5,AZ34,\" \"),\" \"))","v":" "},{"$f":"IF(BA34=\" \",\" \",IF(Input!$G38=\"Girl\",IF(RANK(BA34,($AV34:$BE34),0)<=5,BA34,\" \"),\" \"))","v":" "},{"$f":"IF(BB34=\" \",\" \",IF(Input!$G38=\"Girl\",IF(RANK(BB34,($AV34:$BE34),0)<=5,BB34,\" \"),\" \"))","v":" "},{"$f":"IF(BC34=\" \",\" \",IF(Input!$G38=\"Girl\",IF(RANK(BC34,($AV34:$BE34),0)<=5,BC34,\" \"),\" \"))","v":" "},{"$f":"IF(BD34=\" \",\" \",IF(Input!$G38=\"Girl\",IF(RANK(BD34,($AV34:$BE34),0)<=5,BD34,\" \"),\" \"))","v":" "},{"$f":"IF(BE34=\" \",\" \",IF(Input!$G38=\"Girl\",IF(RANK(BE34,($AV34:$BE34),0)<=5,BE34,\" \"),\" \"))","v":" "},null,{"$error":"#N/A"},{"$error":"#N/A"},{"$error":"#N/A"},{"$error":"#N/A"},{"$error":"#N/A"}," "," "," "," "," ",null," "," "," "," "," "," "," "," "," "," ",2.8E-5,6.7999999999999905E-5,1.08E-4,1.4799999999999999E-4,1.8799999999999999E-4,2.2800000000000001E-4,2.6800000000000001E-4,3.0800000000000098E-4,3.4800000000000098E-4,3.8800000000000097E-4,19.000028,14.000068000000001,12.000108000000001,6.0001480000000003,18.000188000000001," "," "," "," "," "," "," "," "," "," "," "," "," "," "," "," "]
[null,null,{"$f":"Input!D39","v":"Barni Fritz"},{"$f":"Input!#REF!","v":{"$error":"#REF!"}},{"$f":"Input!E39","v":4},{"$f":"Input!F39","v":8},{"$f":"Input!G39","v":"BOY"},25,15,13,27,0,15,0,0,0,0,0,0,95,"Step 4"," "," ",95,"95-BOY-4",{"$f":"Input!D39","v":"Barni Fritz"},{"$f":"IF(Input!E39=0,0,IF(ISNA(VLOOKUP((CONCATENATE(\"Balance Test-\",Input!H39)),points1,2,)),0,(VLOOKUP((CONCATENATE(\"Balance Test-\",Input!H39)),points1,2,))))","v":25},{"$f":"IF(Input!E39=0,0,IF(ISNA(VLOOKUP((CONCATENATE(\"Standing Long Jump-\",Input!I39)),points1,2,)),0,(VLOOKUP((CONCATENATE(\"Standing Long Jump-\",Input!I39)),points1,2,))))","v":15},{"$f":"IF(Input!E39=0,0,IF(ISNA(VLOOKUP((CONCATENATE(\"Speed Bounce-\",Input!J39)),points1,2,)),0,(VLOOKUP((CONCATENATE(\"Speed Bounce-\",Input!J39)),points1,2,))))","v":13},{"$f":"IF(Input!E39=0,0,IF(ISNA(VLOOKUP((CONCATENATE(\"Target Throw-\",Input!K39)),points1,2,)),0,(VLOOKUP((CONCATENATE(\"Target Throw-\",Input!K39)),points1,2,))))","v":27},{"$f":"IF(Input!E39=0,0,IF(Input!$C39>6,IF(ISNA(VLOOKUP((CONCATENATE(\"Overhead Heave-\",Input!L39)),points1,2,)),0,(VLOOKUP((CONCATENATE(\"Overhead Heave-\",Input!L39)),points1,2,))),0))","v":0},27,{"$f":"IF(Input!E39=0,0,IF(ISNA(VLOOKUP((CONCATENATE(\"Hi-Stepper-\",Input!M39)),points1,2,)),0,(VLOOKUP((CONCATENATE(\"Hi-Stepper-\",Input!M39)),points1,2,))))","v":15},{"$f":"IF(Input!E39=0,0,IF(ISNA(VLOOKUP((CONCATENATE(\"Chest Push-\",Input!N39)),points1,2,)),0,(VLOOKUP((CONCATENATE(\"Chest Push-\",Input!N39)),points1,2,))))","v":0},{"$f":"IF(Input!E39=0,0,IF(ISNA(VLOOKUP((CONCATENATE(\"Vertical Jump-\",Input!O39)),points1,2,)),0,(VLOOKUP((CONCATENATE(\"Vertical Jump-\",Input!O39)),points1,2,))))","v":0},{"$f":"IF(Input!E39=0,0,IF(ISNA(VLOOKUP((CONCATENATE(\"Shuttle Run-\",Input!P39)),points1,2,)),0,(VLOOKUP((CONCATENATE(\"Shuttle Run-\",Input!P39)),points1,2,))))","v":0},{"$f":"IF(Input!E39=0,0,IF(ISNA(VLOOKUP((CONCATENATE(\"Javelin Throw-\",Input!Q39)),points1,2,)),0,(VLOOKUP((CONCATENATE(\"Javelin Throw-\",Input!Q39)),points1,2,))))","v":0},{"$f":"IF(Input!E39=0,0,IF(Input!$C39>6,IF(ISNA(VLOOKUP((CONCATENATE(\"Shot-\",Input!R39)),points1,2,)),0,(VLOOKUP((CONCATENATE(\"Shot-\",Input!R39)),points1,2,))),0))","v":0},0,{"$f":"IF(Input!E39=0,0,IF(ISNA(VLOOKUP((CONCATENATE(\"Standing Triple Jump-\",Input!S39)),points1,2,)),0,(VLOOKUP((CONCATENATE(\"Standing Triple Jump-\",Input!S39)),points1,2,))))","v":0},{"$f":"IF(Input!$C39>6,COUNT(Input!H39:J39,Input!M39:P39,Input!S39,Input!X39:Y39),IF(Input!$C39<=6,COUNT(Input!H39:K39,Input!M39:Q39,Input!S39)))","v":5},{"$f":"IF(AO35>=5,(LARGE((AA35:AC35,AF35:AJ35,AM35:AN35),1))+LARGE((AA35:AC35,AF35:AJ35,AM35:AN35),2)+LARGE((AA35:AC35,AF35:AJ35,AM35:AN35),3)+LARGE((AA35:AC35,AF35:AJ35,AM35:AN35),4)+LARGE((AA35:AC35,AF35:AJ35,AM35:AN35),5),0)","v":95},{"$f":"IF(AP35=0,0,IF((Input!G39=\"Boy\")*AND(Input!C39>6),VLOOKUP(AP35,award2,3),IF((Input!G39=\"Girl\")*AND(Input!C39>6),VLOOKUP(AP35,award2,2),IF((Input!G39=\"Boy\")*AND(Input!C39<=6),VLOOKUP(AP35,award12,3),IF((Input!G39=\"Girl\")*AND(Input!C39<=6),VLOOKUP(AP35,award12,2),0)))))","v":"Step 4"},{"$f":"IF(Input!$C39>6,COUNT(Input!H39:J39,Input!M39:P39,Input!S39,Input!X39:Y39),IF(Input!$C39<=6,COUNT(Input!H39:K39,Input!M39:Q39,Input!S39)))","v":5},0,{"$f":"IF(AS35=0,0,IF((Input!G39=\"Boy\")*AND(Input!C39>6),VLOOKUP(AS35,award2,5),IF((Input!G39=\"Girl\")*AND(Input!C39>6),VLOOKUP(AS35,award2,4),IF((Input!G39=\"Boy\")*AND(Input!C39<=6),VLOOKUP(AS35,award12,5),IF((Input!G39=\"Girl\")*AND(Input!C39<=6),VLOOKUP(AS35,award12,4),0)))))","v":0},null,25.000029000000001,15.000069,13.000109,27.000149,15.000189000000001," "," "," "," "," ",null,{"$f":"IF(AV35=\" \",\" \",IF(Input!$G39=\"Boy\",IF(RANK(AV35,($AV35:$BE35),0)<=5,AV35,\" \"),\" \"))","v":25.000029000000001},{"$f":"IF(AW35=\" \",\" \",IF(Input!$G39=\"Boy\",IF(RANK(AW35,($AV35:$BE35),0)<=5,AW35,\" \"),\" \"))","v":15.000069},{"$f":"IF(AX35=\" \",\" \",IF(Input!$G39=\"Boy\",IF(RANK(AX35,($AV35:$BE35),0)<=5,AX35,\" \"),\" \"))","v":13.000109},{"$f":"IF(AY35=\" \",\" \",IF(Input!$G39=\"Boy\",IF(RANK(AY35,($AV35:$BE35),0)<=5,AY35,\" \"),\" \"))","v":27.000149},{"$f":"IF(AZ35=\" \",\" \",IF(Input!$G39=\"Boy\",IF(RANK(AZ35,($AV35:$BE35),0)<=5,AZ35,\" \"),\" \"))","v":15.000189000000001},{"$f":"IF(BA35=\" \",\" \",IF(Input!$G39=\"Boy\",IF(RANK(BA35,($AV35:$BE35),0)<=5,BA35,\" \"),\" \"))","v":" "},{"$f":"IF(BB35=\" \",\" \",IF(Input!$G39=\"Boy\",IF(RANK(BB35,($AV35:$BE35),0)<=5,BB35,\" \"),\" \"))","v":" "},{"$f":"IF(BC35=\" \",\" \",IF(Input!$G39=\"Boy\",IF(RANK(BC35,($AV35:$BE35),0)<=5,BC35,\" \"),\" \"))","v":" "},{"$f":"IF(BD35=\" \",\" \",IF(Input!$G39=\"Boy\",IF(RANK(BD35,($AV35:$BE35),0)<=5,BD35,\" \"),\" \"))","v":" "},{"$f":"IF(BE35=\" \",\" \",IF(Input!$G39=\"Boy\",IF(RANK(BE35,($AV35:$BE35),0)<=5,BE35,\" \"),\" \"))","v":" "},null,{"$f":"IF(AV35=\" \",\" \",IF(Input!$G39=\"Girl\",IF(RANK(AV35,($AV35:$BE35),0)<=5,AV35,\" \"),\" \"))","v":" "},{"$f":"IF(AW35=\" \",\" \",IF(Input!$G39=\"Girl\",IF(RANK(AW35,($AV35:$BE35),0)<=5,AW35,\" \"),\" \"))","v":" "},{"$f":"IF(AX35=\" \",\" \",IF(Input!$G39=\"Girl\",IF(RANK(AX35,($AV35:$BE35),0)<=5,AX35,\" \"),\" \"))","v":" "},{"$f":"IF(AY35=\" \",\" \",IF(Input!$G39=\"Girl\",IF(RANK(AY35,($AV35:$BE35),0)<=5,AY35,\" \"),\" \"))","v":" "},{"$f":"IF(AZ35=\" \",\" \",IF(Input!$G39=\"Girl\",IF(RANK(AZ35,($AV35:$BE35),0)<=5,AZ35,\" \"),\" \"))","v":" "},{"$f":"IF(BA35=\" \",\" \",IF(Input!$G39=\"Girl\",IF(RANK(BA35,($AV35:$BE35),0)<=5,BA35,\" \"),\" \"))","v":" "},{"$f":"IF(BB35=\" \",\" \",IF(Input!$G39=\"Girl\",IF(RANK(BB35,($AV35:$BE35),0)<=5,BB35,\" \"),\" \"))","v":" "},{"$f":"IF(BC35=\" \",\" \",IF(Input!$G39=\"Girl\",IF(RANK(BC35,($AV35:$BE35),0)<=5,BC35,\" \"),\" \"))","v":" "},{"$f":"IF(BD35=\" \",\" \",IF(Input!$G39=\"Girl\",IF(RANK(BD35,($AV35:$BE35),0)<=5,BD35,\" \"),\" \"))","v":" "},{"$f":"IF(BE35=\" \",\" \",IF(Input!$G39=\"Girl\",IF(RANK(BE35,($AV35:$BE35),0)<=5,BE35,\" \"),\" \"))","v":" "},null,{"$error":"#N/A"},{"$error":"#N/A"},{"$error":"#N/A"},{"$error":"#N/A"},{"$error":"#N/A"}," "," "," "," "," ",null," "," "," "," "," "," "," "," "," "," ",2.9E-5,6.8999999999999902E-5,1.0900000000000001E-4,1.4899999999999999E-4,1.8900000000000001E-4,2.2900000000000001E-4,2.6899999999999998E-4,3.0900000000000101E-4,3.49000000000001E-4,3.89000000000001E-4,25.000029000000001,15.000069,13.000109,27.000149,15.000189000000001," "," "," "," "," "," "," "," "," "," "," "," "," "," "," "," "]
[null,null,{"$f":"Input!D40","v":"Charlie Sabbitini"},{"$f":"Input!#REF!","v":{"$error":"#REF!"}},{"$f":"Input!E40","v":6},{"$f":"Input!F40","v":10},{"$f":"Input!G40","v":"BOY"},40,19,24,9,0,20,0,0,0,0,0,0,112,"Step 5",{"$f":"IF(AS36=0,\" \",AS36)","v":" "},{"$f":"IF(AT36=0,\" \",AT36)","v":" "},{"$f":"SUM(H36:S36)","v":112},"112-BOY-6",{"$f":"Input!D40","v":"Charlie Sabbitini"},{"$f":"IF(Input!E40=0,0,IF(ISNA(VLOOKUP((CONCATENATE(\"Balance Test-\",Input!H40)),points1,2,)),0,(VLOOKUP((CONCATENATE(\"Balance Test-\",Input!H40)),points1,2,))))","v":40},{"$f":"IF(Input!E40=0,0,IF(ISNA(VLOOKUP((CONCATENATE(\"Standing Long Jump-\",Input!I40)),points1,2,)),0,(VLOOKUP((CONCATENATE(\"Standing Long Jump-\",Input!I40)),points1,2,))))","v":19},{"$f":"IF(Input!E40=0,0,IF(ISNA(VLOOKUP((CONCATENATE(\"Speed Bounce-\",Input!J40)),points1,2,)),0,(VLOOKUP((CONCATENATE(\"Speed Bounce-\",Input!J40)),points1,2,))))","v":24},{"$f":"IF(Input!E40=0,0,IF(ISNA(VLOOKUP((CONCATENATE(\"Target Throw-\",Input!K40)),points1,2,)),0,(VLOOKUP((CONCATENATE(\"Target Throw-\",Input!K40)),points1,2,))))","v":9},{"$f":"IF(Input!E40=0,0,IF(Input!$C40>6,IF(ISNA(VLOOKUP((CONCATENATE(\"Overhead Heave-\",Input!L40)),points1,2,)),0,(VLOOKUP((CONCATENATE(\"Overhead Heave-\",Input!L40)),points1,2,))),0))","v":0},9,{"$f":"IF(Input!E40=0,0,IF(ISNA(VLOOKUP((CONCATENATE(\"Hi-Stepper-\",Input!M40)),points1,2,)),0,(VLOOKUP((CONCATENATE(\"Hi-Stepper-\",Input!M40)),points1,2,))))","v":20},{"$f":"IF(Input!E40=0,0,IF(ISNA(VLOOKUP((CONCATENATE(\"Chest Push-\",Input!N40)),points1,2,)),0,(VLOOKUP((CONCATENATE(\"Chest Push-\",Input!N40)),points1,2,))))","v":0},{"$f":"IF(Input!E40=0,0,IF(ISNA(VLOOKUP((CONCATENATE(\"Vertical Jump-\",Input!O40)),points1,2,)),0,(VLOOKUP((CONCATENATE(\"Vertical Jump-\",Input!O40)),points1,2,))))","v":0},{"$f":"IF(Input!E40=0,0,IF(ISNA(VLOOKUP((CONCATENATE(\"Shuttle Run-\",Input!P40)),points1,2,)),0,(VLOOKUP((CONCATENATE(\"Shuttle Run-\",Input!P40)),points1,2,))))","v":0},{"$f":"IF(Input!E40=0,0,IF(ISNA(VLOOKUP((CONCATENATE(\"Javelin Throw-\",Input!Q40)),points1,2,)),0,(VLOOKUP((CONCATENATE(\"Javelin Throw-\",Input!Q40)),points1,2,))))","v":0},{"$f":"IF(Input!E40=0,0,IF(Input!$C40>6,IF(ISNA(VLOOKUP((CONCATENATE(\"Shot-\",Input!R40)),points1,2,)),0,(VLOOKUP((CONCATENATE(\"Shot-\",Input!R40)),points1,2,))),0))","v":0},0,{"$f":"IF(Input!E40=0,0,IF(ISNA(VLOOKUP((CONCATENATE(\"Standing Triple Jump-\",Input!S40)),points1,2,)),0,(VLOOKUP((CONCATENATE(\"Standing Triple Jump-\",Input!S40)),points1,2,))))","v":0},{"$f":"IF(Input!$C40>6,COUNT(Input!H40:J40,Input!M40:P40,Input!S40,Input!X40:Y40),IF(Input!$C40<=6,COUNT(Input!H40:K40,Input!M40:Q40,Input!S40)))","v":5},{"$f":"IF(AO36>=5,(LARGE((AA36:AC36,AF36:AJ36,AM36:AN36),1))+LARGE((AA36:AC36,AF36:AJ36,AM36:AN36),2)+LARGE((AA36:AC36,AF36:AJ36,AM36:AN36),3)+LARGE((AA36:AC36,AF36:AJ36,AM36:AN36),4)+LARGE((AA36:AC36,AF36:AJ36,AM36:AN36),5),0)","v":112},{"$f":"IF(AP36=0,0,IF((Input!G40=\"Boy\")*AND(Input!C40>6),VLOOKUP(AP36,award2,3),IF((Input!G40=\"Girl\")*AND(Input!C40>6),VLOOKUP(AP36,award2,2),IF((Input!G40=\"Boy\")*AND(Input!C40<=6),VLOOKUP(AP36,award12,3),IF((Input!G40=\"Girl\")*AND(Input!C40<=6),VLOOKUP(AP36,award12,2),0)))))","v":"Step 5"},{"$f":"IF(Input!$C40>6,COUNT(Input!H40:J40,Input!M40:P40,Input!S40,Input!X40:Y40),IF(Input!$C40<=6,COUNT(Input!H40:K40,Input!M40:Q40,Input!S40)))","v":5},0,{"$f":"IF(AS36=0,0,IF((Input!G40=\"Boy\")*AND(Input!C40>6),VLOOKUP(AS36,award2,5),IF((Input!G40=\"Girl\")*AND(Input!C40>6),VLOOKUP(AS36,award2,4),IF((Input!G40=\"Boy\")*AND(Input!C40<=6),VLOOKUP(AS36,award12,5),IF((Input!G40=\"Girl\")*AND(Input!C40<=6),VLOOKUP(AS36,award12,4),0)))))","v":0},null,40.000030000000002,19.000070000000001,24.000109999999999,9.0001499999999997,20.00019," "," "," "," "," ",null,{"$f":"IF(AV36=\" \",\" \",IF(Input!$G40=\"Boy\",IF(RANK(AV36,($AV36:$BE36),0)<=5,AV36,\" \"),\" \"))","v":40.000030000000002},{"$f":"IF(AW36=\" \",\" \",IF(Input!$G40=\"Boy\",IF(RANK(AW36,($AV36:$BE36),0)<=5,AW36,\" \"),\" \"))","v":19.000070000000001},{"$f":"IF(AX36=\" \",\" \",IF(Input!$G40=\"Boy\",IF(RANK(AX36,($AV36:$BE36),0)<=5,AX36,\" \"),\" \"))","v":24.000109999999999},{"$f":"IF(AY36=\" \",\" \",IF(Input!$G40=\"Boy\",IF(RANK(AY36,($AV36:$BE36),0)<=5,AY36,\" \"),\" \"))","v":9.0001499999999997},{"$f":"IF(AZ36=\" \",\" \",IF(Input!$G40=\"Boy\",IF(RANK(AZ36,($AV36:$BE36),0)<=5,AZ36,\" \"),\" \"))","v":20.00019},{"$f":"IF(BA36=\" \",\" \",IF(Input!$G40=\"Boy\",IF(RANK(BA36,($AV36:$BE36),0)<=5,BA36,\" \"),\" \"))","v":" "},{"$f":"IF(BB36=\" \",\" \",IF(Input!$G40=\"Boy\",IF(RANK(BB36,($AV36:$BE36),0)<=5,BB36,\" \"),\" \"))","v":" "},{"$f":"IF(BC36=\" \",\" \",IF(Input!$G40=\"Boy\",IF(RANK(BC36,($AV36:$BE36),0)<=5,BC36,\" \"),\" \"))","v":" "},{"$f":"IF(BD36=\" \",\" \",IF(Input!$G40=\"Boy\",IF(RANK(BD36,($AV36:$BE36),0)<=5,BD36,\" \"),\" \"))","v":" "},{"$f":"IF(BE36=\" \",\" \",IF(Input!$G40=\"Boy\",IF(RANK(BE36,($AV36:$BE36),0)<=5,BE36,\" \"),\" \"))","v":" "},null,{"$f":"IF(AV36=\" \",\" \",IF(Input!$G40=\"Girl\",IF(RANK(AV36,($AV36:$BE36),0)<=5,AV36,\" \"),\" \"))","v":" "},{"$f":"IF(AW36=\" \",\" \",IF(Input!$G40=\"Girl\",IF(RANK(AW36,($AV36:$BE36),0)<=5,AW36,\" \"),\" \"))","v":" "},{"$f":"IF(AX36=\" \",\" \",IF(Input!$G40=\"Girl\",IF(RANK(AX36,($AV36:$BE36),0)<=5,AX36,\" \"),\" \"))","v":" "},{"$f":"IF(AY36=\" \",\" \",IF(Input!$G40=\"Girl\",IF(RANK(AY36,($AV36:$BE36),0)<=5,AY36,\" \"),\" \"))","v":" "},{"$f":"IF(AZ36=\" \",\" \",IF(Input!$G40=\"Girl\",IF(RANK(AZ36,($AV36:$BE36),0)<=5,AZ36,\" \"),\" \"))","v":" "},{"$f":"IF(BA36=\" \",\" \",IF(Input!$G40=\"Girl\",IF(RANK(BA36,($AV36:$BE36),0)<=5,BA36,\" \"),\" \"))","v":" "},{"$f":"IF(BB36=\" \",\" \",IF(Input!$G40=\"Girl\",IF(RANK(BB36,($AV36:$BE36),0)<=5,BB36,\" \"),\" \"))","v":" "},{"$f":"IF(BC36=\" \",\" \",IF(Input!$G40=\"Girl\",IF(RANK(BC36,($AV36:$BE36),0)<=5,BC36,\" \"),\" \"))","v":" "},{"$f":"IF(BD36=\" \",\" \",IF(Input!$G40=\"Girl\",IF(RANK(BD36,($AV36:$BE36),0)<=5,BD36,\" \"),\" \"))","v":" "},{"$f":"IF(BE36=\" \",\" \",IF(Input!$G40=\"Girl\",IF(RANK(BE36,($AV36:$BE36),0)<=5,BE36,\" \"),\" \"))","v":" "},null,{"$error":"#N/A"},{"$error":"#N/A"},{"$error":"#N/A"},{"$error":"#N/A"},{"$error":"#N/A"}," "," "," "," "," ",null," "," "," "," "," "," "," "," "," "," ",3.0000000000000001E-5,6.9999999999999899E-5,1.1E-4,1.4999999999999999E-4,1.9000000000000001E-4,2.3000000000000001E-4,2.7E-4,3.1000000000000098E-4,3.5000000000000103E-4,3.9000000000000102E-4,40.000030000000002,19.000070000000001,24.000109999999999,9.0001499999999997,20.00019," "," "," "," "," "," "," "," "," "," "," "," "," "," "," "," "]
[null,null,{"$f":"Input!D41","v":"Toby Evans"},{"$f":"Input!#REF!","v":{"$error":"#REF!"}},{"$f":"Input!E41","v":6},{"$f":"Input!F41","v":10},{"$f":"Input!G41","v":"BOY"},63,32,29,54,0,25,0,0,0,0,0,0,203,"Bronze",{"$f":"IF(AS37=0,\" \",AS37)","v":" "},{"$f":"IF(AT37=0,\" \",AT37)","v":" "},{"$f":"SUM(H37:S37)","v":203},"203-BOY-6",{"$f":"Input!D41","v":"Toby Evans"},{"$f":"IF(Input!E41=0,0,IF(ISNA(VLOOKUP((CONCATENATE(\"Balance Test-\",Input!H41)),points1,2,)),0,(VLOOKUP((CONCATENATE(\"Balance Test-\",Input!H41)),points1,2,))))","v":63},{"$f":"IF(Input!E41=0,0,IF(ISNA(VLOOKUP((CONCATENATE(\"Standing Long Jump-\",Input!I41)),points1,2,)),0,(VLOOKUP((CONCATENATE(\"Standing Long Jump-\",Input!I41)),points1,2,))))","v":32},{"$f":"IF(Input!E41=0,0,IF(ISNA(VLOOKUP((CONCATENATE(\"Speed Bounce-\",Input!J41)),points1,2,)),0,(VLOOKUP((CONCATENATE(\"Speed Bounce-\",Input!J41)),points1,2,))))","v":29},{"$f":"IF(Input!E41=0,0,IF(ISNA(VLOOKUP((CONCATENATE(\"Target Throw-\",Input!K41)),points1,2,)),0,(VLOOKUP((CONCATENATE(\"Target Throw-\",Input!K41)),points1,2,))))","v":54},{"$f":"IF(Input!E41=0,0,IF(Input!$C41>6,IF(ISNA(VLOOKUP((CONCATENATE(\"Overhead Heave-\",Input!L41)),points1,2,)),0,(VLOOKUP((CONCATENATE(\"Overhead Heave-\",Input!L41)),points1,2,))),0))","v":0},54,{"$f":"IF(Input!E41=0,0,IF(ISNA(VLOOKUP((CONCATENATE(\"Hi-Stepper-\",Input!M41)),points1,2,)),0,(VLOOKUP((CONCATENATE(\"Hi-Stepper-\",Input!M41)),points1,2,))))","v":25},{"$f":"IF(Input!E41=0,0,IF(ISNA(VLOOKUP((CONCATENATE(\"Chest Push-\",Input!N41)),points1,2,)),0,(VLOOKUP((CONCATENATE(\"Chest Push-\",Input!N41)),points1,2,))))","v":0},{"$f":"IF(Input!E41=0,0,IF(ISNA(VLOOKUP((CONCATENATE(\"Vertical Jump-\",Input!O41)),points1,2,)),0,(VLOOKUP((CONCATENATE(\"Vertical Jump-\",Input!O41)),points1,2,))))","v":0},{"$f":"IF(Input!E41=0,0,IF(ISNA(VLOOKUP((CONCATENATE(\"Shuttle Run-\",Input!P41)),points1,2,)),0,(VLOOKUP((CONCATENATE(\"Shuttle Run-\",Input!P41)),points1,2,))))","v":0},{"$f":"IF(Input!E41=0,0,IF(ISNA(VLOOKUP((CONCATENATE(\"Javelin Throw-\",Input!Q41)),points1,2,)),0,(VLOOKUP((CONCATENATE(\"Javelin Throw-\",Input!Q41)),points1,2,))))","v":0},{"$f":"IF(Input!E41=0,0,IF(Input!$C41>6,IF(ISNA(VLOOKUP((CONCATENATE(\"Shot-\",Input!R41)),points1,2,)),0,(VLOOKUP((CONCATENATE(\"Shot-\",Input!R41)),points1,2,))),0))","v":0},0,{"$f":"IF(Input!E41=0,0,IF(ISNA(VLOOKUP((CONCATENATE(\"Standing Triple Jump-\",Input!S41)),points1,2,)),0,(VLOOKUP((CONCATENATE(\"Standing Triple Jump-\",Input!S41)),points1,2,))))","v":0},{"$f":"IF(Input!$C41>6,COUNT(Input!H41:J41,Input!M41:P41,Input!S41,Input!X41:Y41),IF(Input!$C41<=6,COUNT(Input!H41:K41,Input!M41:Q41,Input!S41)))","v":5},{"$f":"IF(AO37>=5,(LARGE((AA37:AC37,AF37:AJ37,AM37:AN37),1))+LARGE((AA37:AC37,AF37:AJ37,AM37:AN37),2)+LARGE((AA37:AC37,AF37:AJ37,AM37:AN37),3)+LARGE((AA37:AC37,AF37:AJ37,AM37:AN37),4)+LARGE((AA37:AC37,AF37:AJ37,AM37:AN37),5),0)","v":203},{"$f":"IF(AP37=0,0,IF((Input!G41=\"Boy\")*AND(Input!C41>6),VLOOKUP(AP37,award2,3),IF((Input!G41=\"Girl\")*AND(Input!C41>6),VLOOKUP(AP37,award2,2),IF((Input!G41=\"Boy\")*AND(Input!C41<=6),VLOOKUP(AP37,award12,3),IF((Input!G41=\"Girl\")*AND(Input!C41<=6),VLOOKUP(AP37,award12,2),0)))))","v":"Bronze"},{"$f":"IF(Input!$C41>6,COUNT(Input!H41:J41,Input!M41:P41,Input!S41,Input!X41:Y41),IF(Input!$C41<=6,COUNT(Input!H41:K41,Input!M41:Q41,Input!S41)))","v":5},0,{"$f":"IF(AS37=0,0,IF((Input!G41=\"Boy\")*AND(Input!C41>6),VLOOKUP(AS37,award2,5),IF((Input!G41=\"Girl\")*AND(Input!C41>6),VLOOKUP(AS37,award2,4),IF((Input!G41=\"Boy\")*AND(Input!C41<=6),VLOOKUP(AS37,award12,5),IF((Input!G41=\"Girl\")*AND(Input!C41<=6),VLOOKUP(AS37,award12,4),0)))))","v":0},null,63.000031,32.000070999999998,29.000111,54.000151000000002,25.000191000000001," "," "," "," "," ",null,{"$f":"IF(AV37=\" \",\" \",IF(Input!$G41=\"Boy\",IF(RANK(AV37,($AV37:$BE37),0)<=5,AV37,\" \"),\" \"))","v":63.000031},{"$f":"IF(AW37=\" \",\" \",IF(Input!$G41=\"Boy\",IF(RANK(AW37,($AV37:$BE37),0)<=5,AW37,\" \"),\" \"))","v":32.000070999999998},{"$f":"IF(AX37=\" \",\" \",IF(Input!$G41=\"Boy\",IF(RANK(AX37,($AV37:$BE37),0)<=5,AX37,\" \"),\" \"))","v":29.000111},{"$f":"IF(AY37=\" \",\" \",IF(Input!$G41=\"Boy\",IF(RANK(AY37,($AV37:$BE37),0)<=5,AY37,\" \"),\" \"))","v":54.000151000000002},{"$f":"IF(AZ37=\" \",\" \",IF(Input!$G41=\"Boy\",IF(RANK(AZ37,($AV37:$BE37),0)<=5,AZ37,\" \"),\" \"))","v":25.000191000000001},{"$f":"IF(BA37=\" \",\" \",IF(Input!$G41=\"Boy\",IF(RANK(BA37,($AV37:$BE37),0)<=5,BA37,\" \"),\" \"))","v":" "},{"$f":"IF(BB37=\" \",\" \",IF(Input!$G41=\"Boy\",IF(RANK(BB37,($AV37:$BE37),0)<=5,BB37,\" \"),\" \"))","v":" "},{"$f":"IF(BC37=\" \",\" \",IF(Input!$G41=\"Boy\",IF(RANK(BC37,($AV37:$BE37),0)<=5,BC37,\" \"),\" \"))","v":" "},{"$f":"IF(BD37=\" \",\" \",IF(Input!$G41=\"Boy\",IF(RANK(BD37,($AV37:$BE37),0)<=5,BD37,\" \"),\" \"))","v":" "},{"$f":"IF(BE37=\" \",\" \",IF(Input!$G41=\"Boy\",IF(RANK(BE37,($AV37:$BE37),0)<=5,BE37,\" \"),\" \"))","v":" "},null,{"$f":"IF(AV37=\" \",\" \",IF(Input!$G41=\"Girl\",IF(RANK(AV37,($AV37:$BE37),0)<=5,AV37,\" \"),\" \"))","v":" "},{"$f":"IF(AW37=\" \",\" \",IF(Input!$G41=\"Girl\",IF(RANK(AW37,($AV37:$BE37),0)<=5,AW37,\" \"),\" \"))","v":" "},{"$f":"IF(AX37=\" \",\" \",IF(Input!$G41=\"Girl\",IF(RANK(AX37,($AV37:$BE37),0)<=5,AX37,\" \"),\" \"))","v":" "},{"$f":"IF(AY37=\" \",\" \",IF(Input!$G41=\"Girl\",IF(RANK(AY37,($AV37:$BE37),0)<=5,AY37,\" \"),\" \"))","v":" "},{"$f":"IF(AZ37=\" \",\" \",IF(Input!$G41=\"Girl\",IF(RANK(AZ37,($AV37:$BE37),0)<=5,AZ37,\" \"),\" \"))","v":" "},{"$f":"IF(BA37=\" \",\" \",IF(Input!$G41=\"Girl\",IF(RANK(BA37,($AV37:$BE37),0)<=5,BA37,\" \"),\" \"))","v":" "},{"$f":"IF(BB37=\" \",\" \",IF(Input!$G41=\"Girl\",IF(RANK(BB37,($AV37:$BE37),0)<=5,BB37,\" \"),\" \"))","v":" "},{"$f":"IF(BC37=\" \",\" \",IF(Input!$G41=\"Girl\",IF(RANK(BC37,($AV37:$BE37),0)<=5,BC37,\" \"),\" \"))","v":" "},{"$f":"IF(BD37=\" \",\" \",IF(Input!$G41=\"Girl\",IF(RANK(BD37,($AV37:$BE37),0)<=5,BD37,\" \"),\" \"))","v":" "},{"$f":"IF(BE37=\" \",\" \",IF(Input!$G41=\"Girl\",IF(RANK(BE37,($AV37:$BE37),0)<=5,BE37,\" \"),\" \"))","v":" "},null,"RED",{"$error":"#N/A"},{"$error":"#N/A"},"RED",{"$error":"#N/A"}," "," "," "," "," ",null," "," "," "," "," "," "," "," "," "," ",3.1000000000000001E-5,7.0999999999999896E-5,1.11E-4,1.5100000000000001E-4,1.9100000000000001E-4,2.31E-4,2.7099999999999997E-4,3.11000000000001E-4,3.51000000000001E-4,3.9100000000000099E-4,63.000031,32.000070999999998,29.000111,54.000151000000002,25.000191000000001," "," "," "," "," "," "," "," "," "," "," "," "," "," "," "," "]
[null,null,{"$f":"Input!D42","v":"Charlotte Evans"},{"$f":"Input!#REF!","v":{"$error":"#REF!"}},{"$f":"Input!E42","v":4},{"$f":"Input!F42","v":8},{"$f":"Input!G42","v":"GIRL"},61,17,28,12,0,24,0,0,0,0,0,0,142,"Step 8"," "," ",142,"142-GIRL-4",{"$f":"Input!D42","v":"Charlotte Evans"},{"$f":"IF(Input!E42=0,0,IF(ISNA(VLOOKUP((CONCATENATE(\"Balance Test-\",Input!H42)),points1,2,)),0,(VLOOKUP((CONCATENATE(\"Balance Test-\",Input!H42)),points1,2,))))","v":61},{"$f":"IF(Input!E42=0,0,IF(ISNA(VLOOKUP((CONCATENATE(\"Standing Long Jump-\",Input!I42)),points1,2,)),0,(VLOOKUP((CONCATENATE(\"Standing Long Jump-\",Input!I42)),points1,2,))))","v":17},{"$f":"IF(Input!E42=0,0,IF(ISNA(VLOOKUP((CONCATENATE(\"Speed Bounce-\",Input!J42)),points1,2,)),0,(VLOOKUP((CONCATENATE(\"Speed Bounce-\",Input!J42)),points1,2,))))","v":28},{"$f":"IF(Input!E42=0,0,IF(ISNA(VLOOKUP((CONCATENATE(\"Target Throw-\",Input!K42)),points1,2,)),0,(VLOOKUP((CONCATENATE(\"Target Throw-\",Input!K42)),points1,2,))))","v":12},{"$f":"IF(Input!E42=0,0,IF(Input!$C42>6,IF(ISNA(VLOOKUP((CONCATENATE(\"Overhead Heave-\",Input!L42)),points1,2,)),0,(VLOOKUP((CONCATENATE(\"Overhead Heave-\",Input!L42)),points1,2,))),0))","v":0},12,{"$f":"IF(Input!E42=0,0,IF(ISNA(VLOOKUP((CONCATENATE(\"Hi-Stepper-\",Input!M42)),points1,2,)),0,(VLOOKUP((CONCATENATE(\"Hi-Stepper-\",Input!M42)),points1,2,))))","v":24},{"$f":"IF(Input!E42=0,0,IF(ISNA(VLOOKUP((CONCATENATE(\"Chest Push-\",Input!N42)),points1,2,)),0,(VLOOKUP((CONCATENATE(\"Chest Push-\",Input!N42)),points1,2,))))","v":0},{"$f":"IF(Input!E42=0,0,IF(ISNA(VLOOKUP((CONCATENATE(\"Vertical Jump-\",Input!O42)),points1,2,)),0,(VLOOKUP((CONCATENATE(\"Vertical Jump-\",Input!O42)),points1,2,))))","v":0},{"$f":"IF(Input!E42=0,0,IF(ISNA(VLOOKUP((CONCATENATE(\"Shuttle Run-\",Input!P42)),points1,2,)),0,(VLOOKUP((CONCATENATE(\"Shuttle Run-\",Input!P42)),points1,2,))))","v":0},{"$f":"IF(Input!E42=0,0,IF(ISNA(VLOOKUP((CONCATENATE(\"Javelin Throw-\",Input!Q42)),points1,2,)),0,(VLOOKUP((CONCATENATE(\"Javelin Throw-\",Input!Q42)),points1,2,))))","v":0},{"$f":"IF(Input!E42=0,0,IF(Input!$C42>6,IF(ISNA(VLOOKUP((CONCATENATE(\"Shot-\",Input!R42)),points1,2,)),0,(VLOOKUP((CONCATENATE(\"Shot-\",Input!R42)),points1,2,))),0))","v":0},0,{"$f":"IF(Input!E42=0,0,IF(ISNA(VLOOKUP((CONCATENATE(\"Standing Triple Jump-\",Input!S42)),points1,2,)),0,(VLOOKUP((CONCATENATE(\"Standing Triple Jump-\",Input!S42)),points1,2,))))","v":0},{"$f":"IF(Input!$C42>6,COUNT(Input!H42:J42,Input!M42:P42,Input!S42,Input!X42:Y42),IF(Input!$C42<=6,COUNT(Input!H42:K42,Input!M42:Q42,Input!S42)))","v":5},{"$f":"IF(AO38>=5,(LARGE((AA38:AC38,AF38:AJ38,AM38:AN38),1))+LARGE((AA38:AC38,AF38:AJ38,AM38:AN38),2)+LARGE((AA38:AC38,AF38:AJ38,AM38:AN38),3)+LARGE((AA38:AC38,AF38:AJ38,AM38:AN38),4)+LARGE((AA38:AC38,AF38:AJ38,AM38:AN38),5),0)","v":142},{"$f":"IF(AP38=0,0,IF((Input!G42=\"Boy\")*AND(Input!C42>6),VLOOKUP(AP38,award2,3),IF((Input!G42=\"Girl\")*AND(Input!C42>6),VLOOKUP(AP38,award2,2),IF((Input!G42=\"Boy\")*AND(Input!C42<=6),VLOOKUP(AP38,award12,3),IF((Input!G42=\"Girl\")*AND(Input!C42<=6),VLOOKUP(AP38,award12,2),0)))))","v":"Step 8"},{"$f":"IF(Input!$C42>6,COUNT(Input!H42:J42,Input!M42:P42,Input!S42,Input!X42:Y42),IF(Input!$C42<=6,COUNT(Input!H42:K42,Input!M42:Q42,Input!S42)))","v":5},0,{"$f":"IF(AS38=0,0,IF((Input!G42=\"Boy\")*AND(Input!C42>6),VLOOKUP(AS38,award2,5),IF((Input!G42=\"Girl\")*AND(Input!C42>6),VLOOKUP(AS38,award2,4),IF((Input!G42=\"Boy\")*AND(Input!C42<=6),VLOOKUP(AS38,award12,5),IF((Input!G42=\"Girl\")*AND(Input!C42<=6),VLOOKUP(AS38,award12,4),0)))))","v":0},null,61.000031999999997,17.000071999999999,28.000112000000001,12.000152,24.000191999999998," "," "," "," "," ",null,{"$f":"IF(AV38=\" \",\" \",IF(Input!$G42=\"Boy\",IF(RANK(AV38,($AV38:$BE38),0)<=5,AV38,\" \"),\" \"))","v":" "},{"$f":"IF(AW38=\" \",\" \",IF(Input!$G42=\"Boy\",IF(RANK(AW38,($AV38:$BE38),0)<=5,AW38,\" \"),\" \"))","v":" "},{"$f":"IF(AX38=\" \",\" \",IF(Input!$G42=\"Boy\",IF(RANK(AX38,($AV38:$BE38),0)<=5,AX38,\" \"),\" \"))","v":" "},{"$f":"IF(AY38=\" \",\" \",IF(Input!$G42=\"Boy\",IF(RANK(AY38,($AV38:$BE38),0)<=5,AY38,\" \"),\" \"))","v":" "},{"$f":"IF(AZ38=\" \",\" \",IF(Input!$G42=\"Boy\",IF(RANK(AZ38,($AV38:$BE38),0)<=5,AZ38,\" \"),\" \"))","v":" "},{"$f":"IF(BA38=\" \",\" \",IF(Input!$G42=\"Boy\",IF(RANK(BA38,($AV38:$BE38),0)<=5,BA38,\" \"),\" \"))","v":" "},{"$f":"IF(BB38=\" \",\" \",IF(Input!$G42=\"Boy\",IF(RANK(BB38,($AV38:$BE38),0)<=5,BB38,\" \"),\" \"))","v":" "},{"$f":"IF(BC38=\" \",\" \",IF(Input!$G42=\"Boy\",IF(RANK(BC38,($AV38:$BE38),0)<=5,BC38,\" \"),\" \"))","v":" "},{"$f":"IF(BD38=\" \",\" \",IF(Input!$G42=\"Boy\",IF(RANK(BD38,($AV38:$BE38),0)<=5,BD38,\" \"),\" \"))","v":" "},{"$f":"IF(BE38=\" \",\" \",IF(Input!$G42=\"Boy\",IF(RANK(BE38,($AV38:$BE38),0)<=5,BE38,\" \"),\" \"))","v":" "},null,{"$f":"IF(AV38=\" \",\" \",IF(Input!$G42=\"Girl\",IF(RANK(AV38,($AV38:$BE38),0)<=5,AV38,\" \"),\" \"))","v":61.000031999999997},{"$f":"IF(AW38=\" \",\" \",IF(Input!$G42=\"Girl\",IF(RANK(AW38,($AV38:$BE38),0)<=5,AW38,\" \"),\" \"))","v":17.000071999999999},{"$f":"IF(AX38=\" \",\" \",IF(Input!$G42=\"Girl\",IF(RANK(AX38,($AV38:$BE38),0)<=5,AX38,\" \"),\" \"))","v":28.000112000000001},{"$f":"IF(AY38=\" \",\" \",IF(Input!$G42=\"Girl\",IF(RANK(AY38,($AV38:$BE38),0)<=5,AY38,\" \"),\" \"))","v":12.000152},{"$f":"IF(AZ38=\" \",\" \",IF(Input!$G42=\"Girl\",IF(RANK(AZ38,($AV38:$BE38),0)<=5,AZ38,\" \"),\" \"))","v":24.000191999999998},{"$f":"IF(BA38=\" \",\" \",IF(Input!$G42=\"Girl\",IF(RANK(BA38,($AV38:$BE38),0)<=5,BA38,\" \"),\" \"))","v":" "},{"$f":"IF(BB38=\" \",\" \",IF(Input!$G42=\"Girl\",IF(RANK(BB38,($AV38:$BE38),0)<=5,BB38,\" \"),\" \"))","v":" "},{"$f":"IF(BC38=\" \",\" \",IF(Input!$G42=\"Girl\",IF(RANK(BC38,($AV38:$BE38),0)<=5,BC38,\" \"),\" \"))","v":" "},{"$f":"IF(BD38=\" \",\" \",IF(Input!$G42=\"Girl\",IF(RANK(BD38,($AV38:$BE38),0)<=5,BD38,\" \"),\" \"))","v":" "},{"$f":"IF(BE38=\" \",\" \",IF(Input!$G42=\"Girl\",IF(RANK(BE38,($AV38:$BE38),0)<=5,BE38,\" \"),\" \"))","v":" "},null," "," "," "," "," "," "," "," "," "," ",null,{"$error":"#N/A"},{"$error":"#N/A"},{"$error":"#N/A"},{"$error":"#N/A"},{"$error":"#N/A"}," "," "," "," "," ",3.1999999999999999E-5,7.1999999999999893E-5,1.12E-4,1.5200000000000001E-4,1.92E-4,2.32E-4,2.72E-4,3.1200000000000102E-4,3.5200000000000102E-4,3.9200000000000102E-4," "," "," "," "," "," "," "," "," "," "," ",61.000031999999997,17.000071999999999,28.000112000000001,12.000152,24.000191999999998," "," "," "," "," "]
[null,null,{"$f":"Input!D43","v":"James Gibney"},{"$f":"Input!#REF!","v":{"$error":"#REF!"}},{"$f":"Input!E43","v":5},{"$f":"Input!F43","v":9},{"$f":"Input!G43","v":"BOY"},55,23,21,27,0,16,0,0,0,0,0,0,142,"Step 7"," "," ",142,"142-BOY-5",{"$f":"Input!D43","v":"James Gibney"},{"$f":"IF(Input!E43=0,0,IF(ISNA(VLOOKUP((CONCATENATE(\"Balance Test-\",Input!H43)),points1,2,)),0,(VLOOKUP((CONCATENATE(\"Balance Test-\",Input!H43)),points1,2,))))","v":55},{"$f":"IF(Input!E43=0,0,IF(ISNA(VLOOKUP((CONCATENATE(\"Standing Long Jump-\",Input!I43)),points1,2,)),0,(VLOOKUP((CONCATENATE(\"Standing Long Jump-\",Input!I43)),points1,2,))))","v":23},{"$f":"IF(Input!E43=0,0,IF(ISNA(VLOOKUP((CONCATENATE(\"Speed Bounce-\",Input!J43)),points1,2,)),0,(VLOOKUP((CONCATENATE(\"Speed Bounce-\",Input!J43)),points1,2,))))","v":21},{"$f":"IF(Input!E43=0,0,IF(ISNA(VLOOKUP((CONCATENATE(\"Target Throw-\",Input!K43)),points1,2,)),0,(VLOOKUP((CONCATENATE(\"Target Throw-\",Input!K43)),points1,2,))))","v":27},{"$f":"IF(Input!E43=0,0,IF(Input!$C43>6,IF(ISNA(VLOOKUP((CONCATENATE(\"Overhead Heave-\",Input!L43)),points1,2,)),0,(VLOOKUP((CONCATENATE(\"Overhead Heave-\",Input!L43)),points1,2,))),0))","v":0},27,{"$f":"IF(Input!E43=0,0,IF(ISNA(VLOOKUP((CONCATENATE(\"Hi-Stepper-\",Input!M43)),points1,2,)),0,(VLOOKUP((CONCATENATE(\"Hi-Stepper-\",Input!M43)),points1,2,))))","v":16},{"$f":"IF(Input!E43=0,0,IF(ISNA(VLOOKUP((CONCATENATE(\"Chest Push-\",Input!N43)),points1,2,)),0,(VLOOKUP((CONCATENATE(\"Chest Push-\",Input!N43)),points1,2,))))","v":0},{"$f":"IF(Input!E43=0,0,IF(ISNA(VLOOKUP((CONCATENATE(\"Vertical Jump-\",Input!O43)),points1,2,)),0,(VLOOKUP((CONCATENATE(\"Vertical Jump-\",Input!O43)),points1,2,))))","v":0},{"$f":"IF(Input!E43=0,0,IF(ISNA(VLOOKUP((CONCATENATE(\"Shuttle Run-\",Input!P43)),points1,2,)),0,(VLOOKUP((CONCATENATE(\"Shuttle Run-\",Input!P43)),points1,2,))))","v":0},{"$f":"IF(Input!E43=0,0,IF(ISNA(VLOOKUP((CONCATENATE(\"Javelin Throw-\",Input!Q43)),points1,2,)),0,(VLOOKUP((CONCATENATE(\"Javelin Throw-\",Input!Q43)),points1,2,))))","v":0},{"$f":"IF(Input!E43=0,0,IF(Input!$C43>6,IF(ISNA(VLOOKUP((CONCATENATE(\"Shot-\",Input!R43)),points1,2,)),0,(VLOOKUP((CONCATENATE(\"Shot-\",Input!R43)),points1,2,))),0))","v":0},0,{"$f":"IF(Input!E43=0,0,IF(ISNA(VLOOKUP((CONCATENATE(\"Standing Triple Jump-\",Input!S43)),points1,2,)),0,(VLOOKUP((CONCATENATE(\"Standing Triple Jump-\",Input!S43)),points1,2,))))","v":0},{"$f":"IF(Input!$C43>6,COUNT(Input!H43:J43,Input!M43:P43,Input!S43,Input!X43:Y43),IF(Input!$C43<=6,COUNT(Input!H43:K43,Input!M43:Q43,Input!S43)))","v":5},{"$f":"IF(AO39>=5,(LARGE((AA39:AC39,AF39:AJ39,AM39:AN39),1))+LARGE((AA39:AC39,AF39:AJ39,AM39:AN39),2)+LARGE((AA39:AC39,AF39:AJ39,AM39:AN39),3)+LARGE((AA39:AC39,AF39:AJ39,AM39:AN39),4)+LARGE((AA39:AC39,AF39:AJ39,AM39:AN39),5),0)","v":142},{"$f":"IF(AP39=0,0,IF((Input!G43=\"Boy\")*AND(Input!C43>6),VLOOKUP(AP39,award2,3),IF((Input!G43=\"Girl\")*AND(Input!C43>6),VLOOKUP(AP39,award2,2),IF((Input!G43=\"Boy\")*AND(Input!C43<=6),VLOOKUP(AP39,award12,3),IF((Input!G43=\"Girl\")*AND(Input!C43<=6),VLOOKUP(AP39,award12,2),0)))))","v":"Step 7"},{"$f":"IF(Input!$C43>6,COUNT(Input!H43:J43,Input!M43:P43,Input!S43,Input!X43:Y43),IF(Input!$C43<=6,COUNT(Input!H43:K43,Input!M43:Q43,Input!S43)))","v":5},0,{"$f":"IF(AS39=0,0,IF((Input!G43=\"Boy\")*AND(Input!C43>6),VLOOKUP(AS39,award2,5),IF((Input!G43=\"Girl\")*AND(Input!C43>6),VLOOKUP(AS39,award2,4),IF((Input!G43=\"Boy\")*AND(Input!C43<=6),VLOOKUP(AS39,award12,5),IF((Input!G43=\"Girl\")*AND(Input!C43<=6),VLOOKUP(AS39,award12,4),0)))))","v":0},null,55.000033000000002,23.000073,21.000112999999999,27.000153000000001,16.000192999999999," "," "," "," "," ",null,{"$f":"IF(AV39=\" \",\" \",IF(Input!$G43=\"Boy\",IF(RANK(AV39,($AV39:$BE39),0)<=5,AV39,\" \"),\" \"))","v":55.000033000000002},{"$f":"IF(AW39=\" \",\" \",IF(Input!$G43=\"Boy\",IF(RANK(AW39,($AV39:$BE39),0)<=5,AW39,\" \"),\" \"))","v":23.000073},{"$f":"IF(AX39=\" \",\" \",IF(Input!$G43=\"Boy\",IF(RANK(AX39,($AV39:$BE39),0)<=5,AX39,\" \"),\" \"))","v":21.000112999999999},{"$f":"IF(AY39=\" \",\" \",IF(Input!$G43=\"Boy\",IF(RANK(AY39,($AV39:$BE39),0)<=5,AY39,\" \"),\" \"))","v":27.000153000000001},{"$f":"IF(AZ39=\" \",\" \",IF(Input!$G43=\"Boy\",IF(RANK(AZ39,($AV39:$BE39),0)<=5,AZ39,\" \"),\" \"))","v":16.000192999999999},{"$f":"IF(BA39=\" \",\" \",IF(Input!$G43=\"Boy\",IF(RANK(BA39,($AV39:$BE39),0)<=5,BA39,\" \"),\" \"))","v":" "},{"$f":"IF(BB39=\" \",\" \",IF(Input!$G43=\"Boy\",IF(RANK(BB39,($AV39:$BE39),0)<=5,BB39,\" \"),\" \"))","v":" "},{"$f":"IF(BC39=\" \",\" \",IF(Input!$G43=\"Boy\",IF(RANK(BC39,($AV39:$BE39),0)<=5,BC39,\" \"),\" \"))","v":" "},{"$f":"IF(BD39=\" \",\" \",IF(Input!$G43=\"Boy\",IF(RANK(BD39,($AV39:$BE39),0)<=5,BD39,\" \"),\" \"))","v":" "},{"$f":"IF(BE39=\" \",\" \",IF(Input!$G43=\"Boy\",IF(RANK(BE39,($AV39:$BE39),0)<=5,BE39,\" \"),\" \"))","v":" "},null,{"$f":"IF(AV39=\" \",\" \",IF(Input!$G43=\"Girl\",IF(RANK(AV39,($AV39:$BE39),0)<=5,AV39,\" \"),\" \"))","v":" "},{"$f":"IF(AW39=\" \",\" \",IF(Input!$G43=\"Girl\",IF(RANK(AW39,($AV39:$BE39),0)<=5,AW39,\" \"),\" \"))","v":" "},{"$f":"IF(AX39=\" \",\" \",IF(Input!$G43=\"Girl\",IF(RANK(AX39,($AV39:$BE39),0)<=5,AX39,\" \"),\" \"))","v":" "},{"$f":"IF(AY39=\" \",\" \",IF(Input!$G43=\"Girl\",IF(RANK(AY39,($AV39:$BE39),0)<=5,AY39,\" \"),\" \"))","v":" "},{"$f":"IF(AZ39=\" \",\" \",IF(Input!$G43=\"Girl\",IF(RANK(AZ39,($AV39:$BE39),0)<=5,AZ39,\" \"),\" \"))","v":" "},{"$f":"IF(BA39=\" \",\" \",IF(Input!$G43=\"Girl\",IF(RANK(BA39,($AV39:$BE39),0)<=5,BA39,\" \"),\" \"))","v":" "},{"$f":"IF(BB39=\" \",\" \",IF(Input!$G43=\"Girl\",IF(RANK(BB39,($AV39:$BE39),0)<=5,BB39,\" \"),\" \"))","v":" "},{"$f":"IF(BC39=\" \",\" \",IF(Input!$G43=\"Girl\",IF(RANK(BC39,($AV39:$BE39),0)<=5,BC39,\" \"),\" \"))","v":" "},{"$f":"IF(BD39=\" \",\" \",IF(Input!$G43=\"Girl\",IF(RANK(BD39,($AV39:$BE39),0)<=5,BD39,\" \"),\" \"))","v":" "},{"$f":"IF(BE39=\" \",\" \",IF(Input!$G43=\"Girl\",IF(RANK(BE39,($AV39:$BE39),0)<=5,BE39,\" \"),\" \"))","v":" "},null,{"$error":"#N/A"},{"$error":"#N/A"},{"$error":"#N/A"},{"$error":"#N/A"},{"$error":"#N/A"}," "," "," "," "," ",null," "," "," "," "," "," "," "," "," "," ",3.3000000000000003E-5,7.2999999999999904E-5,1.13E-4,1.5300000000000001E-4,1.93E-4,2.33E-4,2.7300000000000002E-4,3.1300000000000099E-4,3.5300000000000099E-4,3.9300000000000099E-4,55.000033000000002,23.000073,21.000112999999999,27.000153000000001,16.000192999999999," "," "," "," "," "," "," "," "," "," "," "," "," "," "," "," "]
[null,null,{"$f":"Input!D44","v":"Orlagh Brunning"},{"$f":"Input!#REF!","v":{"$error":"#REF!"}},{"$f":"Input!E44","v":5},{"$f":"Input!F44","v":9},{"$f":"Input!G44","v":"GIRL"},58,47,28,51,0,33,0,0,0,0,0,0,217,"Bronze"," "," ",217,"217-GIRL-5",{"$f":"Input!D44","v":"Orlagh Brunning"},{"$f":"IF(Input!E44=0,0,IF(ISNA(VLOOKUP((CONCATENATE(\"Balance Test-\",Input!H44)),points1,2,)),0,(VLOOKUP((CONCATENATE(\"Balance Test-\",Input!H44)),points1,2,))))","v":58},{"$f":"IF(Input!E44=0,0,IF(ISNA(VLOOKUP((CONCATENATE(\"Standing Long Jump-\",Input!I44)),points1,2,)),0,(VLOOKUP((CONCATENATE(\"Standing Long Jump-\",Input!I44)),points1,2,))))","v":47},{"$f":"IF(Input!E44=0,0,IF(ISNA(VLOOKUP((CONCATENATE(\"Speed Bounce-\",Input!J44)),points1,2,)),0,(VLOOKUP((CONCATENATE(\"Speed Bounce-\",Input!J44)),points1,2,))))","v":28},{"$f":"IF(Input!E44=0,0,IF(ISNA(VLOOKUP((CONCATENATE(\"Target Throw-\",Input!K44)),points1,2,)),0,(VLOOKUP((CONCATENATE(\"Target Throw-\",Input!K44)),points1,2,))))","v":51},{"$f":"IF(Input!E44=0,0,IF(Input!$C44>6,IF(ISNA(VLOOKUP((CONCATENATE(\"Overhead Heave-\",Input!L44)),points1,2,)),0,(VLOOKUP((CONCATENATE(\"Overhead Heave-\",Input!L44)),points1,2,))),0))","v":0},51,{"$f":"IF(Input!E44=0,0,IF(ISNA(VLOOKUP((CONCATENATE(\"Hi-Stepper-\",Input!M44)),points1,2,)),0,(VLOOKUP((CONCATENATE(\"Hi-Stepper-\",Input!M44)),points1,2,))))","v":33},{"$f":"IF(Input!E44=0,0,IF(ISNA(VLOOKUP((CONCATENATE(\"Chest Push-\",Input!N44)),points1,2,)),0,(VLOOKUP((CONCATENATE(\"Chest Push-\",Input!N44)),points1,2,))))","v":0},{"$f":"IF(Input!E44=0,0,IF(ISNA(VLOOKUP((CONCATENATE(\"Vertical Jump-\",Input!O44)),points1,2,)),0,(VLOOKUP((CONCATENATE(\"Vertical Jump-\",Input!O44)),points1,2,))))","v":0},{"$f":"IF(Input!E44=0,0,IF(ISNA(VLOOKUP((CONCATENATE(\"Shuttle Run-\",Input!P44)),points1,2,)),0,(VLOOKUP((CONCATENATE(\"Shuttle Run-\",Input!P44)),points1,2,))))","v":0},{"$f":"IF(Input!E44=0,0,IF(ISNA(VLOOKUP((CONCATENATE(\"Javelin Throw-\",Input!Q44)),points1,2,)),0,(VLOOKUP((CONCATENATE(\"Javelin Throw-\",Input!Q44)),points1,2,))))","v":0},{"$f":"IF(Input!E44=0,0,IF(Input!$C44>6,IF(ISNA(VLOOKUP((CONCATENATE(\"Shot-\",Input!R44)),points1,2,)),0,(VLOOKUP((CONCATENATE(\"Shot-\",Input!R44)),points1,2,))),0))","v":0},0,{"$f":"IF(Input!E44=0,0,IF(ISNA(VLOOKUP((CONCATENATE(\"Standing Triple Jump-\",Input!S44)),points1,2,)),0,(VLOOKUP((CONCATENATE(\"Standing Triple Jump-\",Input!S44)),points1,2,))))","v":0},{"$f":"IF(Input!$C44>6,COUNT(Input!H44:J44,Input!M44:P44,Input!S44,Input!X44:Y44),IF(Input!$C44<=6,COUNT(Input!H44:K44,Input!M44:Q44,Input!S44)))","v":5},{"$f":"IF(AO40>=5,(LARGE((AA40:AC40,AF40:AJ40,AM40:AN40),1))+LARGE((AA40:AC40,AF40:AJ40,AM40:AN40),2)+LARGE((AA40:AC40,AF40:AJ40,AM40:AN40),3)+LARGE((AA40:AC40,AF40:AJ40,AM40:AN40),4)+LARGE((AA40:AC40,AF40:AJ40,AM40:AN40),5),0)","v":217},{"$f":"IF(AP40=0,0,IF((Input!G44=\"Boy\")*AND(Input!C44>6),VLOOKUP(AP40,award2,3),IF((Input!G44=\"Girl\")*AND(Input!C44>6),VLOOKUP(AP40,award2,2),IF((Input!G44=\"Boy\")*AND(Input!C44<=6),VLOOKUP(AP40,award12,3),IF((Input!G44=\"Girl\")*AND(Input!C44<=6),VLOOKUP(AP40,award12,2),0)))))","v":"Bronze"},{"$f":"IF(Input!$C44>6,COUNT(Input!H44:J44,Input!M44:P44,Input!S44,Input!X44:Y44),IF(Input!$C44<=6,COUNT(Input!H44:K44,Input!M44:Q44,Input!S44)))","v":5},0,{"$f":"IF(AS40=0,0,IF((Input!G44=\"Boy\")*AND(Input!C44>6),VLOOKUP(AS40,award2,5),IF((Input!G44=\"Girl\")*AND(Input!C44>6),VLOOKUP(AS40,award2,4),IF((Input!G44=\"Boy\")*AND(Input!C44<=6),VLOOKUP(AS40,award12,5),IF((Input!G44=\"Girl\")*AND(Input!C44<=6),VLOOKUP(AS40,award12,4),0)))))","v":0},null,58.000033999999999,47.000073999999998,28.000114,51.000154000000002,33.000194," "," "," "," "," ",null,{"$f":"IF(AV40=\" \",\" \",IF(Input!$G44=\"Boy\",IF(RANK(AV40,($AV40:$BE40),0)<=5,AV40,\" \"),\" \"))","v":" "},{"$f":"IF(AW40=\" \",\" \",IF(Input!$G44=\"Boy\",IF(RANK(AW40,($AV40:$BE40),0)<=5,AW40,\" \"),\" \"))","v":" "},{"$f":"IF(AX40=\" \",\" \",IF(Input!$G44=\"Boy\",IF(RANK(AX40,($AV40:$BE40),0)<=5,AX40,\" \"),\" \"))","v":" "},{"$f":"IF(AY40=\" \",\" \",IF(Input!$G44=\"Boy\",IF(RANK(AY40,($AV40:$BE40),0)<=5,AY40,\" \"),\" \"))","v":" "},{"$f":"IF(AZ40=\" \",\" \",IF(Input!$G44=\"Boy\",IF(RANK(AZ40,($AV40:$BE40),0)<=5,AZ40,\" \"),\" \"))","v":" "},{"$f":"IF(BA40=\" \",\" \",IF(Input!$G44=\"Boy\",IF(RANK(BA40,($AV40:$BE40),0)<=5,BA40,\" \"),\" \"))","v":" "},{"$f":"IF(BB40=\" \",\" \",IF(Input!$G44=\"Boy\",IF(RANK(BB40,($AV40:$BE40),0)<=5,BB40,\" \"),\" \"))","v":" "},{"$f":"IF(BC40=\" \",\" \",IF(Input!$G44=\"Boy\",IF(RANK(BC40,($AV40:$BE40),0)<=5,BC40,\" \"),\" \"))","v":" "},{"$f":"IF(BD40=\" \",\" \",IF(Input!$G44=\"Boy\",IF(RANK(BD40,($AV40:$BE40),0)<=5,BD40,\" \"),\" \"))","v":" "},{"$f":"IF(BE40=\" \",\" \",IF(Input!$G44=\"Boy\",IF(RANK(BE40,($AV40:$BE40),0)<=5,BE40,\" \"),\" \"))","v":" "},null,{"$f":"IF(AV40=\" \",\" \",IF(Input!$G44=\"Girl\",IF(RANK(AV40,($AV40:$BE40),0)<=5,AV40,\" \"),\" \"))","v":58.000033999999999},{"$f":"IF(AW40=\" \",\" \",IF(Input!$G44=\"Girl\",IF(RANK(AW40,($AV40:$BE40),0)<=5,AW40,\" \"),\" \"))","v":47.000073999999998},{"$f":"IF(AX40=\" \",\" \",IF(Input!$G44=\"Girl\",IF(RANK(AX40,($AV40:$BE40),0)<=5,AX40,\" \"),\" \"))","v":28.000114},{"$f":"IF(AY40=\" \",\" \",IF(Input!$G44=\"Girl\",IF(RANK(AY40,($AV40:$BE40),0)<=5,AY40,\" \"),\" \"))","v":51.000154000000002},{"$f":"IF(AZ40=\" \",\" \",IF(Input!$G44=\"Girl\",IF(RANK(AZ40,($AV40:$BE40),0)<=5,AZ40,\" \"),\" \"))","v":33.000194},{"$f":"IF(BA40=\" \",\" \",IF(Input!$G44=\"Girl\",IF(RANK(BA40,($AV40:$BE40),0)<=5,BA40,\" \"),\" \"))","v":" "},{"$f":"IF(BB40=\" \",\" \",IF(Input!$G44=\"Girl\",IF(RANK(BB40,($AV40:$BE40),0)<=5,BB40,\" \"),\" \"))","v":" "},{"$f":"IF(BC40=\" \",\" \",IF(Input!$G44=\"Girl\",IF(RANK(BC40,($AV40:$BE40),0)<=5,BC40,\" \"),\" \"))","v":" "},{"$f":"IF(BD40=\" \",\" \",IF(Input!$G44=\"Girl\",IF(RANK(BD40,($AV40:$BE40),0)<=5,BD40,\" \"),\" \"))","v":" "},{"$f":"IF(BE40=\" \",\" \",IF(Input!$G44=\"Girl\",IF(RANK(BE40,($AV40:$BE40),0)<=5,BE40,\" \"),\" \"))","v":" "},null," "," "," "," "," "," "," "," "," "," ",null,{"$error":"#N/A"},"RED",{"$error":"#N/A"},"RED","RED"," "," "," "," "," ",3.4E-5,7.3999999999999901E-5,1.1400000000000001E-4,1.54E-4,1.94E-4,2.34E-4,2.7399999999999999E-4,3.1400000000000102E-4,3.5400000000000102E-4,3.9400000000000101E-4," "," "," "," "," "," "," "," "," "," "," ",58.000033999999999,47.000073999999998,28.000114,51.000154000000002,33.000194," "," "," "," "," "]
[null,null,{"$f":"Input!D45","v":"Harriet Butlin"},{"$f":"Input!#REF!","v":{"$error":"#REF!"}},{"$f":"Input!E45","v":6},{"$f":"Input!F45","v":10},{"$f":"Input!G45","v":"GIRL"},26,26,30,30,0,22,0,0,0,0,0,0,134,"Step 7"," "," ",134,"134-GIRL-6",{"$f":"Input!D45","v":"Harriet Butlin"},{"$f":"IF(Input!E45=0,0,IF(ISNA(VLOOKUP((CONCATENATE(\"Balance Test-\",Input!H45)),points1,2,)),0,(VLOOKUP((CONCATENATE(\"Balance Test-\",Input!H45)),points1,2,))))","v":26},{"$f":"IF(Input!E45=0,0,IF(ISNA(VLOOKUP((CONCATENATE(\"Standing Long Jump-\",Input!I45)),points1,2,)),0,(VLOOKUP((CONCATENATE(\"Standing Long Jump-\",Input!I45)),points1,2,))))","v":26},{"$f":"IF(Input!E45=0,0,IF(ISNA(VLOOKUP((CONCATENATE(\"Speed Bounce-\",Input!J45)),points1,2,)),0,(VLOOKUP((CONCATENATE(\"Speed Bounce-\",Input!J45)),points1,2,))))","v":30},{"$f":"IF(Input!E45=0,0,IF(ISNA(VLOOKUP((CONCATENATE(\"Target Throw-\",Input!K45)),points1,2,)),0,(VLOOKUP((CONCATENATE(\"Target Throw-\",Input!K45)),points1,2,))))","v":30},{"$f":"IF(Input!E45=0,0,IF(Input!$C45>6,IF(ISNA(VLOOKUP((CONCATENATE(\"Overhead Heave-\",Input!L45)),points1,2,)),0,(VLOOKUP((CONCATENATE(\"Overhead Heave-\",Input!L45)),points1,2,))),0))","v":0},30,{"$f":"IF(Input!E45=0,0,IF(ISNA(VLOOKUP((CONCATENATE(\"Hi-Stepper-\",Input!M45)),points1,2,)),0,(VLOOKUP((CONCATENATE(\"Hi-Stepper-\",Input!M45)),points1,2,))))","v":22},{"$f":"IF(Input!E45=0,0,IF(ISNA(VLOOKUP((CONCATENATE(\"Chest Push-\",Input!N45)),points1,2,)),0,(VLOOKUP((CONCATENATE(\"Chest Push-\",Input!N45)),points1,2,))))","v":0},{"$f":"IF(Input!E45=0,0,IF(ISNA(VLOOKUP((CONCATENATE(\"Vertical Jump-\",Input!O45)),points1,2,)),0,(VLOOKUP((CONCATENATE(\"Vertical Jump-\",Input!O45)),points1,2,))))","v":0},{"$f":"IF(Input!E45=0,0,IF(ISNA(VLOOKUP((CONCATENATE(\"Shuttle Run-\",Input!P45)),points1,2,)),0,(VLOOKUP((CONCATENATE(\"Shuttle Run-\",Input!P45)),points1,2,))))","v":0},{"$f":"IF(Input!E45=0,0,IF(ISNA(VLOOKUP((CONCATENATE(\"Javelin Throw-\",Input!Q45)),points1,2,)),0,(VLOOKUP((CONCATENATE(\"Javelin Throw-\",Input!Q45)),points1,2,))))","v":0},{"$f":"IF(Input!E45=0,0,IF(Input!$C45>6,IF(ISNA(VLOOKUP((CONCATENATE(\"Shot-\",Input!R45)),points1,2,)),0,(VLOOKUP((CONCATENATE(\"Shot-\",Input!R45)),points1,2,))),0))","v":0},0,{"$f":"IF(Input!E45=0,0,IF(ISNA(VLOOKUP((CONCATENATE(\"Standing Triple Jump-\",Input!S45)),points1,2,)),0,(VLOOKUP((CONCATENATE(\"Standing Triple Jump-\",Input!S45)),points1,2,))))","v":0},{"$f":"IF(Input!$C45>6,COUNT(Input!H45:J45,Input!M45:P45,Input!S45,Input!X45:Y45),IF(Input!$C45<=6,COUNT(Input!H45:K45,Input!M45:Q45,Input!S45)))","v":5},{"$f":"IF(AO41>=5,(LARGE((AA41:AC41,AF41:AJ41,AM41:AN41),1))+LARGE((AA41:AC41,AF41:AJ41,AM41:AN41),2)+LARGE((AA41:AC41,AF41:AJ41,AM41:AN41),3)+LARGE((AA41:AC41,AF41:AJ41,AM41:AN41),4)+LARGE((AA41:AC41,AF41:AJ41,AM41:AN41),5),0)","v":134},{"$f":"IF(AP41=0,0,IF((Input!G45=\"Boy\")*AND(Input!C45>6),VLOOKUP(AP41,award2,3),IF((Input!G45=\"Girl\")*AND(Input!C45>6),VLOOKUP(AP41,award2,2),IF((Input!G45=\"Boy\")*AND(Input!C45<=6),VLOOKUP(AP41,award12,3),IF((Input!G45=\"Girl\")*AND(Input!C45<=6),VLOOKUP(AP41,award12,2),0)))))","v":"Step 7"},{"$f":"IF(Input!$C45>6,COUNT(Input!H45:J45,Input!M45:P45,Input!S45,Input!X45:Y45),IF(Input!$C45<=6,COUNT(Input!H45:K45,Input!M45:Q45,Input!S45)))","v":5},0,{"$f":"IF(AS41=0,0,IF((Input!G45=\"Boy\")*AND(Input!C45>6),VLOOKUP(AS41,award2,5),IF((Input!G45=\"Girl\")*AND(Input!C45>6),VLOOKUP(AS41,award2,4),IF((Input!G45=\"Boy\")*AND(Input!C45<=6),VLOOKUP(AS41,award12,5),IF((Input!G45=\"Girl\")*AND(Input!C45<=6),VLOOKUP(AS41,award12,4),0)))))","v":0},null,26.000035,26.000074999999999,30.000115000000001,30.000154999999999,22.000195000000001," "," "," "," "," ",null,{"$f":"IF(AV41=\" \",\" \",IF(Input!$G45=\"Boy\",IF(RANK(AV41,($AV41:$BE41),0)<=5,AV41,\" \"),\" \"))","v":" "},{"$f":"IF(AW41=\" \",\" \",IF(Input!$G45=\"Boy\",IF(RANK(AW41,($AV41:$BE41),0)<=5,AW41,\" \"),\" \"))","v":" "},{"$f":"IF(AX41=\" \",\" \",IF(Input!$G45=\"Boy\",IF(RANK(AX41,($AV41:$BE41),0)<=5,AX41,\" \"),\" \"))","v":" "},{"$f":"IF(AY41=\" \",\" \",IF(Input!$G45=\"Boy\",IF(RANK(AY41,($AV41:$BE41),0)<=5,AY41,\" \"),\" \"))","v":" "},{"$f":"IF(AZ41=\" \",\" \",IF(Input!$G45=\"Boy\",IF(RANK(AZ41,($AV41:$BE41),0)<=5,AZ41,\" \"),\" \"))","v":" "},{"$f":"IF(BA41=\" \",\" \",IF(Input!$G45=\"Boy\",IF(RANK(BA41,($AV41:$BE41),0)<=5,BA41,\" \"),\" \"))","v":" "},{"$f":"IF(BB41=\" \",\" \",IF(Input!$G45=\"Boy\",IF(RANK(BB41,($AV41:$BE41),0)<=5,BB41,\" \"),\" \"))","v":" "},{"$f":"IF(BC41=\" \",\" \",IF(Input!$G45=\"Boy\",IF(RANK(BC41,($AV41:$BE41),0)<=5,BC41,\" \"),\" \"))","v":" "},{"$f":"IF(BD41=\" \",\" \",IF(Input!$G45=\"Boy\",IF(RANK(BD41,($AV41:$BE41),0)<=5,BD41,\" \"),\" \"))","v":" "},{"$f":"IF(BE41=\" \",\" \",IF(Input!$G45=\"Boy\",IF(RANK(BE41,($AV41:$BE41),0)<=5,BE41,\" \"),\" \"))","v":" "},null,{"$f":"IF(AV41=\" \",\" \",IF(Input!$G45=\"Girl\",IF(RANK(AV41,($AV41:$BE41),0)<=5,AV41,\" \"),\" \"))","v":26.000035},{"$f":"IF(AW41=\" \",\" \",IF(Input!$G45=\"Girl\",IF(RANK(AW41,($AV41:$BE41),0)<=5,AW41,\" \"),\" \"))","v":26.000074999999999},{"$f":"IF(AX41=\" \",\" \",IF(Input!$G45=\"Girl\",IF(RANK(AX41,($AV41:$BE41),0)<=5,AX41,\" \"),\" \"))","v":30.000115000000001},{"$f":"IF(AY41=\" \",\" \",IF(Input!$G45=\"Girl\",IF(RANK(AY41,($AV41:$BE41),0)<=5,AY41,\" \"),\" \"))","v":30.000154999999999},{"$f":"IF(AZ41=\" \",\" \",IF(Input!$G45=\"Girl\",IF(RANK(AZ41,($AV41:$BE41),0)<=5,AZ41,\" \"),\" \"))","v":22.000195000000001},{"$f":"IF(BA41=\" \",\" \",IF(Input!$G45=\"Girl\",IF(RANK(BA41,($AV41:$BE41),0)<=5,BA41,\" \"),\" \"))","v":" "},{"$f":"IF(BB41=\" \",\" \",IF(Input!$G45=\"Girl\",IF(RANK(BB41,($AV41:$BE41),0)<=5,BB41,\" \"),\" \"))","v":" "},{"$f":"IF(BC41=\" \",\" \",IF(Input!$G45=\"Girl\",IF(RANK(BC41,($AV41:$BE41),0)<=5,BC41,\" \"),\" \"))","v":" "},{"$f":"IF(BD41=\" \",\" \",IF(Input!$G45=\"Girl\",IF(RANK(BD41,($AV41:$BE41),0)<=5,BD41,\" \"),\" \"))","v":" "},{"$f":"IF(BE41=\" \",\" \",IF(Input!$G45=\"Girl\",IF(RANK(BE41,($AV41:$BE41),0)<=5,BE41,\" \"),\" \"))","v":" "},null," "," "," "," "," "," "," "," "," "," ",null,{"$error":"#N/A"},{"$error":"#N/A"},{"$error":"#N/A"}," ",{"$error":"#N/A"}," "," "," "," "," ",3.4999999999999997E-5,7.4999999999999899E-5,1.15E-4,1.55E-4,1.95E-4,2.3499999999999999E-4,2.7500000000000002E-4,3.1500000000000099E-4,3.5500000000000099E-4,3.9500000000000098E-4," "," "," "," "," "," "," "," "," "," "," ",26.000035,26.000074999999999,30.000115000000001,30.000154999999999,22.000195000000001," "," "," "," "," "]
[null,null,{"$f":"Input!D46","v":"Koye Sule"},{"$f":"Input!#REF!","v":{"$error":"#REF!"}},{"$f":"Input!E46","v":4},{"$f":"Input!F46","v":8},{"$f":"Input!G46","v":"BOY"},14,49,21,36,0,15,0,0,0,0,0,0,135,"Step 7"," "," ",135,"135-BOY-4",{"$f":"Input!D46","v":"Koye Sule"},{"$f":"IF(Input!E46=0,0,IF(ISNA(VLOOKUP((CONCATENATE(\"Balance Test-\",Input!H46)),points1,2,)),0,(VLOOKUP((CONCATENATE(\"Balance Test-\",Input!H46)),points1,2,))))","v":14},{"$f":"IF(Input!E46=0,0,IF(ISNA(VLOOKUP((CONCATENATE(\"Standing Long Jump-\",Input!I46)),points1,2,)),0,(VLOOKUP((CONCATENATE(\"Standing Long Jump-\",Input!I46)),points1,2,))))","v":49},{"$f":"IF(Input!E46=0,0,IF(ISNA(VLOOKUP((CONCATENATE(\"Speed Bounce-\",Input!J46)),points1,2,)),0,(VLOOKUP((CONCATENATE(\"Speed Bounce-\",Input!J46)),points1,2,))))","v":21},{"$f":"IF(Input!E46=0,0,IF(ISNA(VLOOKUP((CONCATENATE(\"Target Throw-\",Input!K46)),points1,2,)),0,(VLOOKUP((CONCATENATE(\"Target Throw-\",Input!K46)),points1,2,))))","v":36},{"$f":"IF(Input!E46=0,0,IF(Input!$C46>6,IF(ISNA(VLOOKUP((CONCATENATE(\"Overhead Heave-\",Input!L46)),points1,2,)),0,(VLOOKUP((CONCATENATE(\"Overhead Heave-\",Input!L46)),points1,2,))),0))","v":0},36,{"$f":"IF(Input!E46=0,0,IF(ISNA(VLOOKUP((CONCATENATE(\"Hi-Stepper-\",Input!M46)),points1,2,)),0,(VLOOKUP((CONCATENATE(\"Hi-Stepper-\",Input!M46)),points1,2,))))","v":15},{"$f":"IF(Input!E46=0,0,IF(ISNA(VLOOKUP((CONCATENATE(\"Chest Push-\",Input!N46)),points1,2,)),0,(VLOOKUP((CONCATENATE(\"Chest Push-\",Input!N46)),points1,2,))))","v":0},{"$f":"IF(Input!E46=0,0,IF(ISNA(VLOOKUP((CONCATENATE(\"Vertical Jump-\",Input!O46)),points1,2,)),0,(VLOOKUP((CONCATENATE(\"Vertical Jump-\",Input!O46)),points1,2,))))","v":0},{"$f":"IF(Input!E46=0,0,IF(ISNA(VLOOKUP((CONCATENATE(\"Shuttle Run-\",Input!P46)),points1,2,)),0,(VLOOKUP((CONCATENATE(\"Shuttle Run-\",Input!P46)),points1,2,))))","v":0},{"$f":"IF(Input!E46=0,0,IF(ISNA(VLOOKUP((CONCATENATE(\"Javelin Throw-\",Input!Q46)),points1,2,)),0,(VLOOKUP((CONCATENATE(\"Javelin Throw-\",Input!Q46)),points1,2,))))","v":0},{"$f":"IF(Input!E46=0,0,IF(Input!$C46>6,IF(ISNA(VLOOKUP((CONCATENATE(\"Shot-\",Input!R46)),points1,2,)),0,(VLOOKUP((CONCATENATE(\"Shot-\",Input!R46)),points1,2,))),0))","v":0},0,{"$f":"IF(Input!E46=0,0,IF(ISNA(VLOOKUP((CONCATENATE(\"Standing Triple Jump-\",Input!S46)),points1,2,)),0,(VLOOKUP((CONCATENATE(\"Standing Triple Jump-\",Input!S46)),points1,2,))))","v":0},{"$f":"IF(Input!$C46>6,COUNT(Input!H46:J46,Input!M46:P46,Input!S46,Input!X46:Y46),IF(Input!$C46<=6,COUNT(Input!H46:K46,Input!M46:Q46,Input!S46)))","v":5},{"$f":"IF(AO42>=5,(LARGE((AA42:AC42,AF42:AJ42,AM42:AN42),1))+LARGE((AA42:AC42,AF42:AJ42,AM42:AN42),2)+LARGE((AA42:AC42,AF42:AJ42,AM42:AN42),3)+LARGE((AA42:AC42,AF42:AJ42,AM42:AN42),4)+LARGE((AA42:AC42,AF42:AJ42,AM42:AN42),5),0)","v":135},{"$f":"IF(AP42=0,0,IF((Input!G46=\"Boy\")*AND(Input!C46>6),VLOOKUP(AP42,award2,3),IF((Input!G46=\"Girl\")*AND(Input!C46>6),VLOOKUP(AP42,award2,2),IF((Input!G46=\"Boy\")*AND(Input!C46<=6),VLOOKUP(AP42,award12,3),IF((Input!G46=\"Girl\")*AND(Input!C46<=6),VLOOKUP(AP42,award12,2),0)))))","v":"Step 7"},{"$f":"IF(Input!$C46>6,COUNT(Input!H46:J46,Input!M46:P46,Input!S46,Input!X46:Y46),IF(Input!$C46<=6,COUNT(Input!H46:K46,Input!M46:Q46,Input!S46)))","v":5},0,{"$f":"IF(AS42=0,0,IF((Input!G46=\"Boy\")*AND(Input!C46>6),VLOOKUP(AS42,award2,5),IF((Input!G46=\"Girl\")*AND(Input!C46>6),VLOOKUP(AS42,award2,4),IF((Input!G46=\"Boy\")*AND(Input!C46<=6),VLOOKUP(AS42,award12,5),IF((Input!G46=\"Girl\")*AND(Input!C46<=6),VLOOKUP(AS42,award12,4),0)))))","v":0},null,14.000036,49.000076,21.000115999999998,36.000155999999997,15.000196000000001," "," "," "," "," ",null,{"$f":"IF(AV42=\" \",\" \",IF(Input!$G46=\"Boy\",IF(RANK(AV42,($AV42:$BE42),0)<=5,AV42,\" \"),\" \"))","v":14.000036},{"$f":"IF(AW42=\" \",\" \",IF(Input!$G46=\"Boy\",IF(RANK(AW42,($AV42:$BE42),0)<=5,AW42,\" \"),\" \"))","v":49.000076},{"$f":"IF(AX42=\" \",\" \",IF(Input!$G46=\"Boy\",IF(RANK(AX42,($AV42:$BE42),0)<=5,AX42,\" \"),\" \"))","v":21.000115999999998},{"$f":"IF(AY42=\" \",\" \",IF(Input!$G46=\"Boy\",IF(RANK(AY42,($AV42:$BE42),0)<=5,AY42,\" \"),\" \"))","v":36.000155999999997},{"$f":"IF(AZ42=\" \",\" \",IF(Input!$G46=\"Boy\",IF(RANK(AZ42,($AV42:$BE42),0)<=5,AZ42,\" \"),\" \"))","v":15.000196000000001},{"$f":"IF(BA42=\" \",\" \",IF(Input!$G46=\"Boy\",IF(RANK(BA42,($AV42:$BE42),0)<=5,BA42,\" \"),\" \"))","v":" "},{"$f":"IF(BB42=\" \",\" \",IF(Input!$G46=\"Boy\",IF(RANK(BB42,($AV42:$BE42),0)<=5,BB42,\" \"),\" \"))","v":" "},{"$f":"IF(BC42=\" \",\" \",IF(Input!$G46=\"Boy\",IF(RANK(BC42,($AV42:$BE42),0)<=5,BC42,\" \"),\" \"))","v":" "},{"$f":"IF(BD42=\" \",\" \",IF(Input!$G46=\"Boy\",IF(RANK(BD42,($AV42:$BE42),0)<=5,BD42,\" \"),\" \"))","v":" "},{"$f":"IF(BE42=\" \",\" \",IF(Input!$G46=\"Boy\",IF(RANK(BE42,($AV42:$BE42),0)<=5,BE42,\" \"),\" \"))","v":" "},null,{"$f":"IF(AV42=\" \",\" \",IF(Input!$G46=\"Girl\",IF(RANK(AV42,($AV42:$BE42),0)<=5,AV42,\" \"),\" \"))","v":" "},{"$f":"IF(AW42=\" \",\" \",IF(Input!$G46=\"Girl\",IF(RANK(AW42,($AV42:$BE42),0)<=5,AW42,\" \"),\" \"))","v":" "},{"$f":"IF(AX42=\" \",\" \",IF(Input!$G46=\"Girl\",IF(RANK(AX42,($AV42:$BE42),0)<=5,AX42,\" \"),\" \"))","v":" "},{"$f":"IF(AY42=\" \",\" \",IF(Input!$G46=\"Girl\",IF(RANK(AY42,($AV42:$BE42),0)<=5,AY42,\" \"),\" \"))","v":" "},{"$f":"IF(AZ42=\" \",\" \",IF(Input!$G46=\"Girl\",IF(RANK(AZ42,($AV42:$BE42),0)<=5,AZ42,\" \"),\" \"))","v":" "},{"$f":"IF(BA42=\" \",\" \",IF(Input!$G46=\"Girl\",IF(RANK(BA42,($AV42:$BE42),0)<=5,BA42,\" \"),\" \"))","v":" "},{"$f":"IF(BB42=\" \",\" \",IF(Input!$G46=\"Girl\",IF(RANK(BB42,($AV42:$BE42),0)<=5,BB42,\" \"),\" \"))","v":" "},{"$f":"IF(BC42=\" \",\" \",IF(Input!$G46=\"Girl\",IF(RANK(BC42,($AV42:$BE42),0)<=5,BC42,\" \"),\" \"))","v":" "},{"$f":"IF(BD42=\" \",\" \",IF(Input!$G46=\"Girl\",IF(RANK(BD42,($AV42:$BE42),0)<=5,BD42,\" \"),\" \"))","v":" "},{"$f":"IF(BE42=\" \",\" \",IF(Input!$G46=\"Girl\",IF(RANK(BE42,($AV42:$BE42),0)<=5,BE42,\" \"),\" \"))","v":" "},null,{"$error":"#N/A"},"RED",{"$error":"#N/A"},{"$error":"#N/A"},{"$error":"#N/A"}," "," "," "," "," ",null," "," "," "," "," "," "," "," "," "," ",3.6000000000000001E-5,7.5999999999999896E-5,1.16E-4,1.56E-4,1.9599999999999999E-4,2.3599999999999999E-4,2.7599999999999999E-4,3.1600000000000101E-4,3.5600000000000101E-4,3.9600000000000101E-4,14.000036,49.000076,21.000115999999998,36.000155999999997,15.000196000000001," "," "," "," "," "," "," "," "," "," "," "," "," "," "," "," "]
[null,null,{"$f":"Input!D47","v":0},{"$f":"Input!#REF!","v":{"$error":"#REF!"}},{"$f":"Input!E47","v":0},{"$f":"Input!F47","v":0},{"$f":"Input!G47","v":0},0,0,0,0,0,0,0,0,0,0,0,0," "," "," "," ",0," -0-0",{"$f":"Input!D47","v":0},{"$f":"IF(Input!E47=0,0,IF(ISNA(VLOOKUP((CONCATENATE(\"Balance Test-\",Input!H47)),points1,2,)),0,(VLOOKUP((CONCATENATE(\"Balance Test-\",Input!H47)),points1,2,))))","v":0},{"$f":"IF(Input!E47=0,0,IF(ISNA(VLOOKUP((CONCATENATE(\"Standing Long Jump-\",Input!I47)),points1,2,)),0,(VLOOKUP((CONCATENATE(\"Standing Long Jump-\",Input!I47)),points1,2,))))","v":0},{"$f":"IF(Input!E47=0,0,IF(ISNA(VLOOKUP((CONCATENATE(\"Speed Bounce-\",Input!J47)),points1,2,)),0,(VLOOKUP((CONCATENATE(\"Speed Bounce-\",Input!J47)),points1,2,))))","v":0},{"$f":"IF(Input!E47=0,0,IF(ISNA(VLOOKUP((CONCATENATE(\"Target Throw-\",Input!K47)),points1,2,)),0,(VLOOKUP((CONCATENATE(\"Target Throw-\",Input!K47)),points1,2,))))","v":0},{"$f":"IF(Input!E47=0,0,IF(Input!$C47>6,IF(ISNA(VLOOKUP((CONCATENATE(\"Overhead Heave-\",Input!L47)),points1,2,)),0,(VLOOKUP((CONCATENATE(\"Overhead Heave-\",Input!L47)),points1,2,))),0))","v":0},0,{"$f":"IF(Input!E47=0,0,IF(ISNA(VLOOKUP((CONCATENATE(\"Hi-Stepper-\",Input!M47)),points1,2,)),0,(VLOOKUP((CONCATENATE(\"Hi-Stepper-\",Input!M47)),points1,2,))))","v":0},{"$f":"IF(Input!E47=0,0,IF(ISNA(VLOOKUP((CONCATENATE(\"Chest Push-\",Input!N47)),points1,2,)),0,(VLOOKUP((CONCATENATE(\"Chest Push-\",Input!N47)),points1,2,))))","v":0},{"$f":"IF(Input!E47=0,0,IF(ISNA(VLOOKUP((CONCATENATE(\"Vertical Jump-\",Input!O47)),points1,2,)),0,(VLOOKUP((CONCATENATE(\"Vertical Jump-\",Input!O47)),points1,2,))))","v":0},{"$f":"IF(Input!E47=0,0,IF(ISNA(VLOOKUP((CONCATENATE(\"Shuttle Run-\",Input!P47)),points1,2,)),0,(VLOOKUP((CONCATENATE(\"Shuttle Run-\",Input!P47)),points1,2,))))","v":0},{"$f":"IF(Input!E47=0,0,IF(ISNA(VLOOKUP((CONCATENATE(\"Javelin Throw-\",Input!Q47)),points1,2,)),0,(VLOOKUP((CONCATENATE(\"Javelin Throw-\",Input!Q47)),points1,2,))))","v":0},{"$f":"IF(Input!E47=0,0,IF(Input!$C47>6,IF(ISNA(VLOOKUP((CONCATENATE(\"Shot-\",Input!R47)),points1,2,)),0,(VLOOKUP((CONCATENATE(\"Shot-\",Input!R47)),points1,2,))),0))","v":0},0,{"$f":"IF(Input!E47=0,0,IF(ISNA(VLOOKUP((CONCATENATE(\"Standing Triple Jump-\",Input!S47)),points1,2,)),0,(VLOOKUP((CONCATENATE(\"Standing Triple Jump-\",Input!S47)),points1,2,))))","v":0},{"$f":"IF(Input!$C47>6,COUNT(Input!H47:J47,Input!M47:P47,Input!S47,Input!X47:Y47),IF(Input!$C47<=6,COUNT(Input!H47:K47,Input!M47:Q47,Input!S47)))","v":0},{"$f":"IF(AO43>=5,(LARGE((AA43:AC43,AF43:AJ43,AM43:AN43),1))+LARGE((AA43:AC43,AF43:AJ43,AM43:AN43),2)+LARGE((AA43:AC43,AF43:AJ43,AM43:AN43),3)+LARGE((AA43:AC43,AF43:AJ43,AM43:AN43),4)+LARGE((AA43:AC43,AF43:AJ43,AM43:AN43),5),0)","v":0},{"$f":"IF(AP43=0,0,IF((Input!G47=\"Boy\")*AND(Input!C47>6),VLOOKUP(AP43,award2,3),IF((Input!G47=\"Girl\")*AND(Input!C47>6),VLOOKUP(AP43,award2,2),IF((Input!G47=\"Boy\")*AND(Input!C47<=6),VLOOKUP(AP43,award12,3),IF((Input!G47=\"Girl\")*AND(Input!C47<=6),VLOOKUP(AP43,award12,2),0)))))","v":0},{"$f":"IF(Input!$C47>6,COUNT(Input!H47:J47,Input!M47:P47,Input!S47,Input!X47:Y47),IF(Input!$C47<=6,COUNT(Input!H47:K47,Input!M47:Q47,Input!S47)))","v":0},0,{"$f":"IF(AS43=0,0,IF((Input!G47=\"Boy\")*AND(Input!C47>6),VLOOKUP(AS43,award2,5),IF((Input!G47=\"Girl\")*AND(Input!C47>6),VLOOKUP(AS43,award2,4),IF((Input!G47=\"Boy\")*AND(Input!C47<=6),VLOOKUP(AS43,award12,5),IF((Input!G47=\"Girl\")*AND(Input!C47<=6),VLOOKUP(AS43,award12,4),0)))))","v":0},null," "," "," "," "," "," "," "," "," "," ",null,{"$f":"IF(AV43=\" \",\" \",IF(Input!$G47=\"Boy\",IF(RANK(AV43,($AV43:$BE43),0)<=5,AV43,\" \"),\" \"))","v":" "},{"$f":"IF(AW43=\" \",\" \",IF(Input!$G47=\"Boy\",IF(RANK(AW43,($AV43:$BE43),0)<=5,AW43,\" \"),\" \"))","v":" "},{"$f":"IF(AX43=\" \",\" \",IF(Input!$G47=\"Boy\",IF(RANK(AX43,($AV43:$BE43),0)<=5,AX43,\" \"),\" \"))","v":" "},{"$f":"IF(AY43=\" \",\" \",IF(Input!$G47=\"Boy\",IF(RANK(AY43,($AV43:$BE43),0)<=5,AY43,\" \"),\" \"))","v":" "},{"$f":"IF(AZ43=\" \",\" \",IF(Input!$G47=\"Boy\",IF(RANK(AZ43,($AV43:$BE43),0)<=5,AZ43,\" \"),\" \"))","v":" "},{"$f":"IF(BA43=\" \",\" \",IF(Input!$G47=\"Boy\",IF(RANK(BA43,($AV43:$BE43),0)<=5,BA43,\" \"),\" \"))","v":" "},{"$f":"IF(BB43=\" \",\" \",IF(Input!$G47=\"Boy\",IF(RANK(BB43,($AV43:$BE43),0)<=5,BB43,\" \"),\" \"))","v":" "},{"$f":"IF(BC43=\" \",\" \",IF(Input!$G47=\"Boy\",IF(RANK(BC43,($AV43:$BE43),0)<=5,BC43,\" \"),\" \"))","v":" "},{"$f":"IF(BD43=\" \",\" \",IF(Input!$G47=\"Boy\",IF(RANK(BD43,($AV43:$BE43),0)<=5,BD43,\" \"),\" \"))","v":" "},{"$f":"IF(BE43=\" \",\" \",IF(Input!$G47=\"Boy\",IF(RANK(BE43,($AV43:$BE43),0)<=5,BE43,\" \"),\" \"))","v":" "},null,{"$f":"IF(AV43=\" \",\" \",IF(Input!$G47=\"Girl\",IF(RANK(AV43,($AV43:$BE43),0)<=5,AV43,\" \"),\" \"))","v":" "},{"$f":"IF(AW43=\" \",\" \",IF(Input!$G47=\"Girl\",IF(RANK(AW43,($AV43:$BE43),0)<=5,AW43,\" \"),\" \"))","v":" "},{"$f":"IF(AX43=\" \",\" \",IF(Input!$G47=\"Girl\",IF(RANK(AX43,($AV43:$BE43),0)<=5,AX43,\" \"),\" \"))","v":" "},{"$f":"IF(AY43=\" \",\" \",IF(Input!$G47=\"Girl\",IF(RANK(AY43,($AV43:$BE43),0)<=5,AY43,\" \"),\" \"))","v":" "},{"$f":"IF(AZ43=\" \",\" \",IF(Input!$G47=\"Girl\",IF(RANK(AZ43,($AV43:$BE43),0)<=5,AZ43,\" \"),\" \"))","v":" "},{"$f":"IF(BA43=\" \",\" \",IF(Input!$G47=\"Girl\",IF(RANK(BA43,($AV43:$BE43),0)<=5,BA43,\" \"),\" \"))","v":" "},{"$f":"IF(BB43=\" \",\" \",IF(Input!$G47=\"Girl\",IF(RANK(BB43,($AV43:$BE43),0)<=5,BB43,\" \"),\" \"))","v":" "},{"$f":"IF(BC43=\" \",\" \",IF(Input!$G47=\"Girl\",IF(RANK(BC43,($AV43:$BE43),0)<=5,BC43,\" \"),\" \"))","v":" "},{"$f":"IF(BD43=\" \",\" \",IF(Input!$G47=\"Girl\",IF(RANK(BD43,($AV43:$BE43),0)<=5,BD43,\" \"),\" \"))","v":" "},{"$f":"IF(BE43=\" \",\" \",IF(Input!$G47=\"Girl\",IF(RANK(BE43,($AV43:$BE43),0)<=5,BE43,\" \"),\" \"))","v":" "},null," "," "," "," "," "," "," "," "," "," ",null," "," "," "," "," "," "," "," "," "," ",3.6999999999999998E-5,7.6999999999999907E-5,1.17E-4,1.5699999999999999E-4,1.9699999999999999E-4,2.3699999999999999E-4,2.7700000000000001E-4,3.1700000000000098E-4,3.5700000000000098E-4,3.9700000000000098E-4," "," "," "," "," "," "," "," "," "," "," "," "," "," "," "," "," "," "," "," "," "]
[null,null,{"$f":"Input!D48","v":0},{"$f":"Input!#REF!","v":{"$error":"#REF!"}},{"$f":"Input!E48","v":0},{"$f":"Input!F48","v":0},{"$f":"Input!G48","v":0},0,0,0,0,0,0,0,0,0,0,0,0," "," "," "," ",0," -0-0",{"$f":"Input!D48","v":0},{"$f":"IF(Input!E48=0,0,IF(ISNA(VLOOKUP((CONCATENATE(\"Balance Test-\",Input!H48)),points1,2,)),0,(VLOOKUP((CONCATENATE(\"Balance Test-\",Input!H48)),points1,2,))))","v":0},{"$f":"IF(Input!E48=0,0,IF(ISNA(VLOOKUP((CONCATENATE(\"Standing Long Jump-\",Input!I48)),points1,2,)),0,(VLOOKUP((CONCATENATE(\"Standing Long Jump-\",Input!I48)),points1,2,))))","v":0},{"$f":"IF(Input!E48=0,0,IF(ISNA(VLOOKUP((CONCATENATE(\"Speed Bounce-\",Input!J48)),points1,2,)),0,(VLOOKUP((CONCATENATE(\"Speed Bounce-\",Input!J48)),points1,2,))))","v":0},{"$f":"IF(Input!E48=0,0,IF(ISNA(VLOOKUP((CONCATENATE(\"Target Throw-\",Input!K48)),points1,2,)),0,(VLOOKUP((CONCATENATE(\"Target Throw-\",Input!K48)),points1,2,))))","v":0},{"$f":"IF(Input!E48=0,0,IF(Input!$C48>6,IF(ISNA(VLOOKUP((CONCATENATE(\"Overhead Heave-\",Input!L48)),points1,2,)),0,(VLOOKUP((CONCATENATE(\"Overhead Heave-\",Input!L48)),points1,2,))),0))","v":0},0,{"$f":"IF(Input!E48=0,0,IF(ISNA(VLOOKUP((CONCATENATE(\"Hi-Stepper-\",Input!M48)),points1,2,)),0,(VLOOKUP((CONCATENATE(\"Hi-Stepper-\",Input!M48)),points1,2,))))","v":0},{"$f":"IF(Input!E48=0,0,IF(ISNA(VLOOKUP((CONCATENATE(\"Chest Push-\",Input!N48)),points1,2,)),0,(VLOOKUP((CONCATENATE(\"Chest Push-\",Input!N48)),points1,2,))))","v":0},{"$f":"IF(Input!E48=0,0,IF(ISNA(VLOOKUP((CONCATENATE(\"Vertical Jump-\",Input!O48)),points1,2,)),0,(VLOOKUP((CONCATENATE(\"Vertical Jump-\",Input!O48)),points1,2,))))","v":0},{"$f":"IF(Input!E48=0,0,IF(ISNA(VLOOKUP((CONCATENATE(\"Shuttle Run-\",Input!P48)),points1,2,)),0,(VLOOKUP((CONCATENATE(\"Shuttle Run-\",Input!P48)),points1,2,))))","v":0},{"$f":"IF(Input!E48=0,0,IF(ISNA(VLOOKUP((CONCATENATE(\"Javelin Throw-\",Input!Q48)),points1,2,)),0,(VLOOKUP((CONCATENATE(\"Javelin Throw-\",Input!Q48)),points1,2,))))","v":0},{"$f":"IF(Input!E48=0,0,IF(Input!$C48>6,IF(ISNA(VLOOKUP((CONCATENATE(\"Shot-\",Input!R48)),points1,2,)),0,(VLOOKUP((CONCATENATE(\"Shot-\",Input!R48)),points1,2,))),0))","v":0},0,{"$f":"IF(Input!E48=0,0,IF(ISNA(VLOOKUP((CONCATENATE(\"Standing Triple Jump-\",Input!S48)),points1,2,)),0,(VLOOKUP((CONCATENATE(\"Standing Triple Jump-\",Input!S48)),points1,2,))))","v":0},{"$f":"IF(Input!$C48>6,COUNT(Input!H48:J48,Input!M48:P48,Input!S48,Input!X48:Y48),IF(Input!$C48<=6,COUNT(Input!H48:K48,Input!M48:Q48,Input!S48)))","v":0},{"$f":"IF(AO44>=5,(LARGE((AA44:AC44,AF44:AJ44,AM44:AN44),1))+LARGE((AA44:AC44,AF44:AJ44,AM44:AN44),2)+LARGE((AA44:AC44,AF44:AJ44,AM44:AN44),3)+LARGE((AA44:AC44,AF44:AJ44,AM44:AN44),4)+LARGE((AA44:AC44,AF44:AJ44,AM44:AN44),5),0)","v":0},{"$f":"IF(AP44=0,0,IF((Input!G48=\"Boy\")*AND(Input!C48>6),VLOOKUP(AP44,award2,3),IF((Input!G48=\"Girl\")*AND(Input!C48>6),VLOOKUP(AP44,award2,2),IF((Input!G48=\"Boy\")*AND(Input!C48<=6),VLOOKUP(AP44,award12,3),IF((Input!G48=\"Girl\")*AND(Input!C48<=6),VLOOKUP(AP44,award12,2),0)))))","v":0},{"$f":"IF(Input!$C48>6,COUNT(Input!H48:J48,Input!M48:P48,Input!S48,Input!X48:Y48),IF(Input!$C48<=6,COUNT(Input!H48:K48,Input!M48:Q48,Input!S48)))","v":0},0,{"$f":"IF(AS44=0,0,IF((Input!G48=\"Boy\")*AND(Input!C48>6),VLOOKUP(AS44,award2,5),IF((Input!G48=\"Girl\")*AND(Input!C48>6),VLOOKUP(AS44,award2,4),IF((Input!G48=\"Boy\")*AND(Input!C48<=6),VLOOKUP(AS44,award12,5),IF((Input!G48=\"Girl\")*AND(Input!C48<=6),VLOOKUP(AS44,award12,4),0)))))","v":0},null," "," "," "," "," "," "," "," "," "," ",null,{"$f":"IF(AV44=\" \",\" \",IF(Input!$G48=\"Boy\",IF(RANK(AV44,($AV44:$BE44),0)<=5,AV44,\" \"),\" \"))","v":" "},{"$f":"IF(AW44=\" \",\" \",IF(Input!$G48=\"Boy\",IF(RANK(AW44,($AV44:$BE44),0)<=5,AW44,\" \"),\" \"))","v":" "},{"$f":"IF(AX44=\" \",\" \",IF(Input!$G48=\"Boy\",IF(RANK(AX44,($AV44:$BE44),0)<=5,AX44,\" \"),\" \"))","v":" "},{"$f":"IF(AY44=\" \",\" \",IF(Input!$G48=\"Boy\",IF(RANK(AY44,($AV44:$BE44),0)<=5,AY44,\" \"),\" \"))","v":" "},{"$f":"IF(AZ44=\" \",\" \",IF(Input!$G48=\"Boy\",IF(RANK(AZ44,($AV44:$BE44),0)<=5,AZ44,\" \"),\" \"))","v":" "},{"$f":"IF(BA44=\" \",\" \",IF(Input!$G48=\"Boy\",IF(RANK(BA44,($AV44:$BE44),0)<=5,BA44,\" \"),\" \"))","v":" "},{"$f":"IF(BB44=\" \",\" \",IF(Input!$G48=\"Boy\",IF(RANK(BB44,($AV44:$BE44),0)<=5,BB44,\" \"),\" \"))","v":" "},{"$f":"IF(BC44=\" \",\" \",IF(Input!$G48=\"Boy\",IF(RANK(BC44,($AV44:$BE44),0)<=5,BC44,\" \"),\" \"))","v":" "},{"$f":"IF(BD44=\" \",\" \",IF(Input!$G48=\"Boy\",IF(RANK(BD44,($AV44:$BE44),0)<=5,BD44,\" \"),\" \"))","v":" "},{"$f":"IF(BE44=\" \",\" \",IF(Input!$G48=\"Boy\",IF(RANK(BE44,($AV44:$BE44),0)<=5,BE44,\" \"),\" \"))","v":" "},null,{"$f":"IF(AV44=\" \",\" \",IF(Input!$G48=\"Girl\",IF(RANK(AV44,($AV44:$BE44),0)<=5,AV44,\" \"),\" \"))","v":" "},{"$f":"IF(AW44=\" \",\" \",IF(Input!$G48=\"Girl\",IF(RANK(AW44,($AV44:$BE44),0)<=5,AW44,\" \"),\" \"))","v":" "},{"$f":"IF(AX44=\" \",\" \",IF(Input!$G48=\"Girl\",IF(RANK(AX44,($AV44:$BE44),0)<=5,AX44,\" \"),\" \"))","v":" "},{"$f":"IF(AY44=\" \",\" \",IF(Input!$G48=\"Girl\",IF(RANK(AY44,($AV44:$BE44),0)<=5,AY44,\" \"),\" \"))","v":" "},{"$f":"IF(AZ44=\" \",\" \",IF(Input!$G48=\"Girl\",IF(RANK(AZ44,($AV44:$BE44),0)<=5,AZ44,\" \"),\" \"))","v":" "},{"$f":"IF(BA44=\" \",\" \",IF(Input!$G48=\"Girl\",IF(RANK(BA44,($AV44:$BE44),0)<=5,BA44,\" \"),\" \"))","v":" "},{"$f":"IF(BB44=\" \",\" \",IF(Input!$G48=\"Girl\",IF(RANK(BB44,($AV44:$BE44),0)<=5,BB44,\" \"),\" \"))","v":" "},{"$f":"IF(BC44=\" \",\" \",IF(Input!$G48=\"Girl\",IF(RANK(BC44,($AV44:$BE44),0)<=5,BC44,\" \"),\" \"))","v":" "},{"$f":"IF(BD44=\" \",\" \",IF(Input!$G48=\"Girl\",IF(RANK(BD44,($AV44:$BE44),0)<=5,BD44,\" \"),\" \"))","v":" "},{"$f":"IF(BE44=\" \",\" \",IF(Input!$G48=\"Girl\",IF(RANK(BE44,($AV44:$BE44),0)<=5,BE44,\" \"),\" \"))","v":" "},null," "," "," "," "," "," "," "," "," "," ",null," "," "," "," "," "," "," "," "," "," ",3.8000000000000002E-5,7.7999999999999904E-5,1.18E-4,1.5799999999999999E-4,1.9799999999999999E-4,2.3800000000000001E-4,2.7799999999999998E-4,3.1800000000000101E-4,3.58000000000001E-4,3.98000000000001E-4," "," "," "," "," "," "," "," "," "," "," "," "," "," "," "," "," "," "," "," "," "]
[null,null,{"$f":"Input!D49","v":0},{"$f":"Input!#REF!","v":{"$error":"#REF!"}},{"$f":"Input!E49","v":0},{"$f":"Input!F49","v":0},{"$f":"Input!G49","v":0},0,0,0,0,0,0,0,0,0,0,0,0," "," "," "," ",0," -0-0",{"$f":"Input!D49","v":0},{"$f":"IF(Input!E49=0,0,IF(ISNA(VLOOKUP((CONCATENATE(\"Balance Test-\",Input!H49)),points1,2,)),0,(VLOOKUP((CONCATENATE(\"Balance Test-\",Input!H49)),points1,2,))))","v":0},{"$f":"IF(Input!E49=0,0,IF(ISNA(VLOOKUP((CONCATENATE(\"Standing Long Jump-\",Input!I49)),points1,2,)),0,(VLOOKUP((CONCATENATE(\"Standing Long Jump-\",Input!I49)),points1,2,))))","v":0},{"$f":"IF(Input!E49=0,0,IF(ISNA(VLOOKUP((CONCATENATE(\"Speed Bounce-\",Input!J49)),points1,2,)),0,(VLOOKUP((CONCATENATE(\"Speed Bounce-\",Input!J49)),points1,2,))))","v":0},{"$f":"IF(Input!E49=0,0,IF(ISNA(VLOOKUP((CONCATENATE(\"Target Throw-\",Input!K49)),points1,2,)),0,(VLOOKUP((CONCATENATE(\"Target Throw-\",Input!K49)),points1,2,))))","v":0},{"$f":"IF(Input!E49=0,0,IF(Input!$C49>6,IF(ISNA(VLOOKUP((CONCATENATE(\"Overhead Heave-\",Input!L49)),points1,2,)),0,(VLOOKUP((CONCATENATE(\"Overhead Heave-\",Input!L49)),points1,2,))),0))","v":0},0,{"$f":"IF(Input!E49=0,0,IF(ISNA(VLOOKUP((CONCATENATE(\"Hi-Stepper-\",Input!M49)),points1,2,)),0,(VLOOKUP((CONCATENATE(\"Hi-Stepper-\",Input!M49)),points1,2,))))","v":0},{"$f":"IF(Input!E49=0,0,IF(ISNA(VLOOKUP((CONCATENATE(\"Chest Push-\",Input!N49)),points1,2,)),0,(VLOOKUP((CONCATENATE(\"Chest Push-\",Input!N49)),points1,2,))))","v":0},{"$f":"IF(Input!E49=0,0,IF(ISNA(VLOOKUP((CONCATENATE(\"Vertical Jump-\",Input!O49)),points1,2,)),0,(VLOOKUP((CONCATENATE(\"Vertical Jump-\",Input!O49)),points1,2,))))","v":0},{"$f":"IF(Input!E49=0,0,IF(ISNA(VLOOKUP((CONCATENATE(\"Shuttle Run-\",Input!P49)),points1,2,)),0,(VLOOKUP((CONCATENATE(\"Shuttle Run-\",Input!P49)),points1,2,))))","v":0},{"$f":"IF(Input!E49=0,0,IF(ISNA(VLOOKUP((CONCATENATE(\"Javelin Throw-\",Input!Q49)),points1,2,)),0,(VLOOKUP((CONCATENATE(\"Javelin Throw-\",Input!Q49)),points1,2,))))","v":0},{"$f":"IF(Input!E49=0,0,IF(Input!$C49>6,IF(ISNA(VLOOKUP((CONCATENATE(\"Shot-\",Input!R49)),points1,2,)),0,(VLOOKUP((CONCATENATE(\"Shot-\",Input!R49)),points1,2,))),0))","v":0},0,{"$f":"IF(Input!E49=0,0,IF(ISNA(VLOOKUP((CONCATENATE(\"Standing Triple Jump-\",Input!S49)),points1,2,)),0,(VLOOKUP((CONCATENATE(\"Standing Triple Jump-\",Input!S49)),points1,2,))))","v":0},{"$f":"IF(Input!$C49>6,COUNT(Input!H49:J49,Input!M49:P49,Input!S49,Input!X49:Y49),IF(Input!$C49<=6,COUNT(Input!H49:K49,Input!M49:Q49,Input!S49)))","v":0},{"$f":"IF(AO45>=5,(LARGE((AA45:AC45,AF45:AJ45,AM45:AN45),1))+LARGE((AA45:AC45,AF45:AJ45,AM45:AN45),2)+LARGE((AA45:AC45,AF45:AJ45,AM45:AN45),3)+LARGE((AA45:AC45,AF45:AJ45,AM45:AN45),4)+LARGE((AA45:AC45,AF45:AJ45,AM45:AN45),5),0)","v":0},{"$f":"IF(AP45=0,0,IF((Input!G49=\"Boy\")*AND(Input!C49>6),VLOOKUP(AP45,award2,3),IF((Input!G49=\"Girl\")*AND(Input!C49>6),VLOOKUP(AP45,award2,2),IF((Input!G49=\"Boy\")*AND(Input!C49<=6),VLOOKUP(AP45,award12,3),IF((Input!G49=\"Girl\")*AND(Input!C49<=6),VLOOKUP(AP45,award12,2),0)))))","v":0},{"$f":"IF(Input!$C49>6,COUNT(Input!H49:J49,Input!M49:P49,Input!S49,Input!X49:Y49),IF(Input!$C49<=6,COUNT(Input!H49:K49,Input!M49:Q49,Input!S49)))","v":0},0,{"$f":"IF(AS45=0,0,IF((Input!G49=\"Boy\")*AND(Input!C49>6),VLOOKUP(AS45,award2,5),IF((Input!G49=\"Girl\")*AND(Input!C49>6),VLOOKUP(AS45,award2,4),IF((Input!G49=\"Boy\")*AND(Input!C49<=6),VLOOKUP(AS45,award12,5),IF((Input!G49=\"Girl\")*AND(Input!C49<=6),VLOOKUP(AS45,award12,4),0)))))","v":0},null," "," "," "," "," "," "," "," "," "," ",null,{"$f":"IF(AV45=\" \",\" \",IF(Input!$G49=\"Boy\",IF(RANK(AV45,($AV45:$BE45),0)<=5,AV45,\" \"),\" \"))","v":" "},{"$f":"IF(AW45=\" \",\" \",IF(Input!$G49=\"Boy\",IF(RANK(AW45,($AV45:$BE45),0)<=5,AW45,\" \"),\" \"))","v":" "},{"$f":"IF(AX45=\" \",\" \",IF(Input!$G49=\"Boy\",IF(RANK(AX45,($AV45:$BE45),0)<=5,AX45,\" \"),\" \"))","v":" "},{"$f":"IF(AY45=\" \",\" \",IF(Input!$G49=\"Boy\",IF(RANK(AY45,($AV45:$BE45),0)<=5,AY45,\" \"),\" \"))","v":" "},{"$f":"IF(AZ45=\" \",\" \",IF(Input!$G49=\"Boy\",IF(RANK(AZ45,($AV45:$BE45),0)<=5,AZ45,\" \"),\" \"))","v":" "},{"$f":"IF(BA45=\" \",\" \",IF(Input!$G49=\"Boy\",IF(RANK(BA45,($AV45:$BE45),0)<=5,BA45,\" \"),\" \"))","v":" "},{"$f":"IF(BB45=\" \",\" \",IF(Input!$G49=\"Boy\",IF(RANK(BB45,($AV45:$BE45),0)<=5,BB45,\" \"),\" \"))","v":" "},{"$f":"IF(BC45=\" \",\" \",IF(Input!$G49=\"Boy\",IF(RANK(BC45,($AV45:$BE45),0)<=5,BC45,\" \"),\" \"))","v":" "},{"$f":"IF(BD45=\" \",\" \",IF(Input!$G49=\"Boy\",IF(RANK(BD45,($AV45:$BE45),0)<=5,BD45,\" \"),\" \"))","v":" "},{"$f":"IF(BE45=\" \",\" \",IF(Input!$G49=\"Boy\",IF(RANK(BE45,($AV45:$BE45),0)<=5,BE45,\" \"),\" \"))","v":" "},null,{"$f":"IF(AV45=\" \",\" \",IF(Input!$G49=\"Girl\",IF(RANK(AV45,($AV45:$BE45),0)<=5,AV45,\" \"),\" \"))","v":" "},{"$f":"IF(AW45=\" \",\" \",IF(Input!$G49=\"Girl\",IF(RANK(AW45,($AV45:$BE45),0)<=5,AW45,\" \"),\" \"))","v":" "},{"$f":"IF(AX45=\" \",\" \",IF(Input!$G49=\"Girl\",IF(RANK(AX45,($AV45:$BE45),0)<=5,AX45,\" \"),\" \"))","v":" "},{"$f":"IF(AY45=\" \",\" \",IF(Input!$G49=\"Girl\",IF(RANK(AY45,($AV45:$BE45),0)<=5,AY45,\" \"),\" \"))","v":" "},{"$f":"IF(AZ45=\" \",\" \",IF(Input!$G49=\"Girl\",IF(RANK(AZ45,($AV45:$BE45),0)<=5,AZ45,\" \"),\" \"))","v":" "},{"$f":"IF(BA45=\" \",\" \",IF(Input!$G49=\"Girl\",IF(RANK(BA45,($AV45:$BE45),0)<=5,BA45,\" \"),\" \"))","v":" "},{"$f":"IF(BB45=\" \",\" \",IF(Input!$G49=\"Girl\",IF(RANK(BB45,($AV45:$BE45),0)<=5,BB45,\" \"),\" \"))","v":" "},{"$f":"IF(BC45=\" \",\" \",IF(Input!$G49=\"Girl\",IF(RANK(BC45,($AV45:$BE45),0)<=5,BC45,\" \"),\" \"))","v":" "},{"$f":"IF(BD45=\" \",\" \",IF(Input!$G49=\"Girl\",IF(RANK(BD45,($AV45:$BE45),0)<=5,BD45,\" \"),\" \"))","v":" "},{"$f":"IF(BE45=\" \",\" \",IF(Input!$G49=\"Girl\",IF(RANK(BE45,($AV45:$BE45),0)<=5,BE45,\" \"),\" \"))","v":" "},null," "," "," "," "," "," "," "," "," "," ",null," "," "," "," "," "," "," "," "," "," ",3.8999999999999999E-5,7.8999999999999901E-5,1.1900000000000001E-4,1.5899999999999999E-4,1.9900000000000001E-4,2.3900000000000001E-4,2.7900000000000001E-4,3.1900000000000098E-4,3.5900000000000097E-4,3.9900000000000102E-4," "," "," "," "," "," "," "," "," "," "," "," "," "," "," "," "," "," "," "," "," "]
[null,null,{"$f":"Input!D50","v":0},{"$f":"Input!#REF!","v":{"$error":"#REF!"}},{"$f":"Input!E50","v":0},{"$f":"Input!F50","v":0},{"$f":"Input!G50","v":0},0,0,0,0,{"$f":"IF(AE46=0,0,AE46)","v":0},0,0,0,0,0,{"$f":"IF(AL46=0,0,AL46)","v":0},0," "," "," "," ",0," -0-0",{"$f":"Input!D50","v":0},{"$f":"IF(Input!E50=0,0,IF(ISNA(VLOOKUP((CONCATENATE(\"Balance Test-\",Input!H50)),points1,2,)),0,(VLOOKUP((CONCATENATE(\"Balance Test-\",Input!H50)),points1,2,))))","v":0},{"$f":"IF(Input!E50=0,0,IF(ISNA(VLOOKUP((CONCATENATE(\"Standing Long Jump-\",Input!I50)),points1,2,)),0,(VLOOKUP((CONCATENATE(\"Standing Long Jump-\",Input!I50)),points1,2,))))","v":0},{"$f":"IF(Input!E50=0,0,IF(ISNA(VLOOKUP((CONCATENATE(\"Speed Bounce-\",Input!J50)),points1,2,)),0,(VLOOKUP((CONCATENATE(\"Speed Bounce-\",Input!J50)),points1,2,))))","v":0},{"$f":"IF(Input!E50=0,0,IF(ISNA(VLOOKUP((CONCATENATE(\"Target Throw-\",Input!K50)),points1,2,)),0,(VLOOKUP((CONCATENATE(\"Target Throw-\",Input!K50)),points1,2,))))","v":0},{"$f":"IF(Input!E50=0,0,IF(Input!$C50>6,IF(ISNA(VLOOKUP((CONCATENATE(\"Overhead Heave-\",Input!L50)),points1,2,)),0,(VLOOKUP((CONCATENATE(\"Overhead Heave-\",Input!L50)),points1,2,))),0))","v":0},0,{"$f":"IF(Input!E50=0,0,IF(ISNA(VLOOKUP((CONCATENATE(\"Hi-Stepper-\",Input!M50)),points1,2,)),0,(VLOOKUP((CONCATENATE(\"Hi-Stepper-\",Input!M50)),points1,2,))))","v":0},{"$f":"IF(Input!E50=0,0,IF(ISNA(VLOOKUP((CONCATENATE(\"Chest Push-\",Input!N50)),points1,2,)),0,(VLOOKUP((CONCATENATE(\"Chest Push-\",Input!N50)),points1,2,))))","v":0},{"$f":"IF(Input!E50=0,0,IF(ISNA(VLOOKUP((CONCATENATE(\"Vertical Jump-\",Input!O50)),points1,2,)),0,(VLOOKUP((CONCATENATE(\"Vertical Jump-\",Input!O50)),points1,2,))))","v":0},{"$f":"IF(Input!E50=0,0,IF(ISNA(VLOOKUP((CONCATENATE(\"Shuttle Run-\",Input!P50)),points1,2,)),0,(VLOOKUP((CONCATENATE(\"Shuttle Run-\",Input!P50)),points1,2,))))","v":0},{"$f":"IF(Input!E50=0,0,IF(ISNA(VLOOKUP((CONCATENATE(\"Javelin Throw-\",Input!Q50)),points1,2,)),0,(VLOOKUP((CONCATENATE(\"Javelin Throw-\",Input!Q50)),points1,2,))))","v":0},{"$f":"IF(Input!E50=0,0,IF(Input!$C50>6,IF(ISNA(VLOOKUP((CONCATENATE(\"Shot-\",Input!R50)),points1,2,)),0,(VLOOKUP((CONCATENATE(\"Shot-\",Input!R50)),points1,2,))),0))","v":0},0,{"$f":"IF(Input!E50=0,0,IF(ISNA(VLOOKUP((CONCATENATE(\"Standing Triple Jump-\",Input!S50)),points1,2,)),0,(VLOOKUP((CONCATENATE(\"Standing Triple Jump-\",Input!S50)),points1,2,))))","v":0},{"$f":"IF(Input!$C50>6,COUNT(Input!H50:J50,Input!M50:P50,Input!S50,Input!X50:Y50),IF(Input!$C50<=6,COUNT(Input!H50:K50,Input!M50:Q50,Input!S50)))","v":0},{"$f":"IF(AO46>=5,(LARGE((AA46:AC46,AF46:AJ46,AM46:AN46),1))+LARGE((AA46:AC46,AF46:AJ46,AM46:AN46),2)+LARGE((AA46:AC46,AF46:AJ46,AM46:AN46),3)+LARGE((AA46:AC46,AF46:AJ46,AM46:AN46),4)+LARGE((AA46:AC46,AF46:AJ46,AM46:AN46),5),0)","v":0},{"$f":"IF(AP46=0,0,IF((Input!G50=\"Boy\")*AND(Input!C50>6),VLOOKUP(AP46,award2,3),IF((Input!G50=\"Girl\")*AND(Input!C50>6),VLOOKUP(AP46,award2,2),IF((Input!G50=\"Boy\")*AND(Input!C50<=6),VLOOKUP(AP46,award12,3),IF((Input!G50=\"Girl\")*AND(Input!C50<=6),VLOOKUP(AP46,award12,2),0)))))","v":0},{"$f":"IF(Input!$C50>6,COUNT(Input!H50:J50,Input!M50:P50,Input!S50,Input!X50:Y50),IF(Input!$C50<=6,COUNT(Input!H50:K50,Input!M50:Q50,Input!S50)))","v":0},0,{"$f":"IF(AS46=0,0,IF((Input!G50=\"Boy\")*AND(Input!C50>6),VLOOKUP(AS46,award2,5),IF((Input!G50=\"Girl\")*AND(Input!C50>6),VLOOKUP(AS46,award2,4),IF((Input!G50=\"Boy\")*AND(Input!C50<=6),VLOOKUP(AS46,award12,5),IF((Input!G50=\"Girl\")*AND(Input!C50<=6),VLOOKUP(AS46,award12,4),0)))))","v":0},null," "," "," "," "," "," "," "," "," "," ",null,{"$f":"IF(AV46=\" \",\" \",IF(Input!$G50=\"Boy\",IF(RANK(AV46,($AV46:$BE46),0)<=5,AV46,\" \"),\" \"))","v":" "},{"$f":"IF(AW46=\" \",\" \",IF(Input!$G50=\"Boy\",IF(RANK(AW46,($AV46:$BE46),0)<=5,AW46,\" \"),\" \"))","v":" "},{"$f":"IF(AX46=\" \",\" \",IF(Input!$G50=\"Boy\",IF(RANK(AX46,($AV46:$BE46),0)<=5,AX46,\" \"),\" \"))","v":" "},{"$f":"IF(AY46=\" \",\" \",IF(Input!$G50=\"Boy\",IF(RANK(AY46,($AV46:$BE46),0)<=5,AY46,\" \"),\" \"))","v":" "},{"$f":"IF(AZ46=\" \",\" \",IF(Input!$G50=\"Boy\",IF(RANK(AZ46,($AV46:$BE46),0)<=5,AZ46,\" \"),\" \"))","v":" "},{"$f":"IF(BA46=\" \",\" \",IF(Input!$G50=\"Boy\",IF(RANK(BA46,($AV46:$BE46),0)<=5,BA46,\" \"),\" \"))","v":" "},{"$f":"IF(BB46=\" \",\" \",IF(Input!$G50=\"Boy\",IF(RANK(BB46,($AV46:$BE46),0)<=5,BB46,\" \"),\" \"))","v":" "},{"$f":"IF(BC46=\" \",\" \",IF(Input!$G50=\"Boy\",IF(RANK(BC46,($AV46:$BE46),0)<=5,BC46,\" \"),\" \"))","v":" "},{"$f":"IF(BD46=\" \",\" \",IF(Input!$G50=\"Boy\",IF(RANK(BD46,($AV46:$BE46),0)<=5,BD46,\" \"),\" \"))","v":" "},{"$f":"IF(BE46=\" \",\" \",IF(Input!$G50=\"Boy\",IF(RANK(BE46,($AV46:$BE46),0)<=5,BE46,\" \"),\" \"))","v":" "},null,{"$f":"IF(AV46=\" \",\" \",IF(Input!$G50=\"Girl\",IF(RANK(AV46,($AV46:$BE46),0)<=5,AV46,\" \"),\" \"))","v":" "},{"$f":"IF(AW46=\" \",\" \",IF(Input!$G50=\"Girl\",IF(RANK(AW46,($AV46:$BE46),0)<=5,AW46,\" \"),\" \"))","v":" "},{"$f":"IF(AX46=\" \",\" \",IF(Input!$G50=\"Girl\",IF(RANK(AX46,($AV46:$BE46),0)<=5,AX46,\" \"),\" \"))","v":" "},{"$f":"IF(AY46=\" \",\" \",IF(Input!$G50=\"Girl\",IF(RANK(AY46,($AV46:$BE46),0)<=5,AY46,\" \"),\" \"))","v":" "},{"$f":"IF(AZ46=\" \",\" \",IF(Input!$G50=\"Girl\",IF(RANK(AZ46,($AV46:$BE46),0)<=5,AZ46,\" \"),\" \"))","v":" "},{"$f":"IF(BA46=\" \",\" \",IF(Input!$G50=\"Girl\",IF(RANK(BA46,($AV46:$BE46),0)<=5,BA46,\" \"),\" \"))","v":" "},{"$f":"IF(BB46=\" \",\" \",IF(Input!$G50=\"Girl\",IF(RANK(BB46,($AV46:$BE46),0)<=5,BB46,\" \"),\" \"))","v":" "},{"$f":"IF(BC46=\" \",\" \",IF(Input!$G50=\"Girl\",IF(RANK(BC46,($AV46:$BE46),0)<=5,BC46,\" \"),\" \"))","v":" "},{"$f":"IF(BD46=\" \",\" \",IF(Input!$G50=\"Girl\",IF(RANK(BD46,($AV46:$BE46),0)<=5,BD46,\" \"),\" \"))","v":" "},{"$f":"IF(BE46=\" \",\" \",IF(Input!$G50=\"Girl\",IF(RANK(BE46,($AV46:$BE46),0)<=5,BE46,\" \"),\" \"))","v":" "},null," "," "," "," "," "," "," "," "," "," ",null," "," "," "," "," "," "," "," "," "," ",4.0000000000000003E-5,7.9999999999999898E-5,1.2E-4,1.6000000000000001E-4,2.0000000000000001E-4,2.4000000000000001E-4,2.7999999999999998E-4,3.20000000000001E-4,3.60000000000001E-4,4.0000000000000099E-4," "," "," "," "," "," "," "," "," "," "," "," "," "," "," "," "," "," "," "," "," "]
[null,null,null,null,null,null,null,null,null,null,null,null,null,null,null,null,null,null,null,null,null,null,null,null,null,null,null,null,null,null,null,null,null,null,null,null,null,null,null,null,null,null,null,null,null,null,null,{"$f":"COUNT(AV7:AV46)","v":36},{"$f":"COUNT(AW7:AW46)","v":36},36,28,36,8,0,0,0,0,null,{"$f":"COUNT(BG7:BG46)","v":19},{"$f":"COUNT(BH7:BH46)","v":19},19,15,19,4,0,0,0,0,{"$f":"SUM(BG47:BP47)","v":95},{"$f":"COUNT(BR7:BR46)","v":17},{"$f":"COUNT(BS7:BS46)","v":17},17,13,17,4,0,0,0,0,{"$f":"SUM(BR47:CA47)","v":85},null,null,null,null,null,null,null,null,null,null,null,{"$f":"IF(BR47=\" \",0,IF(AND(RANK(BR47,BR$48:CA$52,0)<=25)*OR(BR47=BR$48,BR47=BR$49,BR47=BR$50,BR47=BR$51,BR47=BR$52),\"RED\",0))","v":{"$error":"#N/A"}},{"$f":"IF(BS47=\" \",0,IF(AND(RANK(BS47,BS47:BS86,0)<=5)*(BS47>0)*OR(BS47=BS$48,BS47=BS$49,BS47=BS$50,BS47=BS$51,BS47=BS$52),\"RED\",0))","v":0},0,0,0,0,0,0,0,0,null,null,null,null,null,null,null,null,null,null,{"$f":"COUNT(DH7:DH46)","v":19},{"$f":"COUNT(DI7:DI46)","v":19},19,15,19,4,0,0,0,0,0,17,17,17,13,17,4,0,0,0,0]
[null,null,null,null,null,null,null,null,null,null,null,null,null,null,null,null,null,null,null,null,null,null,null,null,null,null,null,null,null,null,null,null,null,null,null,null,null,null,null,null,null,null,null,null,null,null,null,{"$f":"IF(AV$47>0,LARGE(AV$7:AV$46,1),0)","v":65.000024999999994},{"$f":"IF(AW$47>0,LARGE(AW$7:AW$46,1),0)","v":50.000055000000003},42.000095000000002,57.000129000000001,52.000169999999997,46.000225999999998,0,0,0,0,null,{"$f":"IF(BG$47>0,LARGE(BG$7:BG$46,1),0)","v":65.000020000000006},{"$f":"IF(BH$47>0,LARGE(BH$7:BH$46,1),0)","v":50.000055000000003},42.000095000000002,57.000129000000001,52.000169999999997,40.000214999999997,0,0,0,0,null,{"$f":"IF(BR$47>0,LARGE(BR$7:BR$46,1),0)","v":65.000024999999994},{"$f":"IF(BS$47>0,LARGE(BS$7:BS$46,1),0)","v":50.000047000000002},36.000084999999999,51.000154000000002,40.000185000000002,46.000225999999998,0,0,0,0,null,null,null,null,null,null,null,null,null,null,null,null,null,null,null,null,null,null,null,null,null,null,null,null,null,null,null,null,null,null,null,null,{"$f":"IF(DH$47>0,LARGE(DH$7:DH$46,1),0)","v":65.000020000000006},{"$f":"IF(DI$47>0,LARGE(DI$7:DI$46,1),0)","v":50.000055000000003},42.000095000000002,57.000129000000001,52.000169999999997,40.000214999999997,0,0,0,0,0,65.000024999999994,50.000047000000002,36.000084999999999,51.000154000000002,40.000185000000002,46.000225999999998,0,0,0,0]
[null,null,null,null,null,null,null,null,null,null,null,null,null,null,null,null,null,null,null,null,null,null,null,null,null,null,null,null,null,null,null,null,null,null,null,null,null,null,null,null,null,null,null,null,null,null,null,{"$f":"IF(AV$47>1,LARGE(AV$7:AV$46,2),0)","v":65.000020000000006},{"$f":"IF(AW$47>1,LARGE(AW$7:AW$46,2),0)","v":50.000047000000002},36.000084999999999,54.000151000000002,46.000174999999999,44.000224000000003,0,0,0,0,null,{"$f":"IF(BG$47>1,LARGE(BG$7:BG$46,2),0)","v":65.000015000000005},{"$f":"IF(BH$47>1,LARGE(BH$7:BH$46,2),0)","v":49.000076},34.00009,54.000151000000002,46.000174999999999,36.000213000000002,0,0,0,0,null,{"$f":"IF(BR$47>1,LARGE(BR$7:BR$46,2),0)","v":65.000011999999998},{"$f":"IF(BS$47>1,LARGE(BS$7:BS$46,2),0)","v":49.000064999999999},33.000092000000002,51.000124,33.000194,44.000224000000003,0,0,0,0,null,null,null,null,null,null,null,null,null,null,null,null,null,null,null,null,null,null,null,null,null,null,null,null,null,null,null,null,null,null,null,null,{"$f":"IF(DH$47>1,LARGE(DH$7:DH$46,2),0)","v":65.000015000000005},{"$f":"IF(DI$47>1,LARGE(DI$7:DI$46,2),0)","v":49.000076},34.00009,54.000151000000002,46.000174999999999,36.000213000000002,0,0,0,0,0,65.000011999999998,49.000064999999999,33.000092000000002,51.000124,33.000194,44.000224000000003,0,0,0,0]
[null,null,null,null,null,null,null,null,null,null,null,null,null,null,null,null,null,null,null,null,null,null,null,null,null,null,null,null,null,null,null,null,null,null,null,null,null,null,null,null,null,null,null,null,null,null,null,{"$f":"IF(AV$47>2,LARGE(AV$7:AV$46,3),0)","v":65.000015000000005},{"$f":"IF(AW$47>2,LARGE(AW$7:AW$46,3),0)","v":49.000076},34.00009,51.000154000000002,46.000172999999997,42.000225,0,0,0,0,null,{"$f":"IF(BG$47>2,LARGE(BG$7:BG$46,3),0)","v":63.000031},{"$f":"IF(BH$47>2,LARGE(BH$7:BH$46,3),0)","v":44.000058000000003},33.000100000000003,48.000143000000001,46.000172999999997,31.000214,0,0,0,0,null,{"$f":"IF(BR$47>2,LARGE(BR$7:BR$46,3),0)","v":65.000005000000002},{"$f":"IF(BS$47>2,LARGE(BS$7:BS$46,3),0)","v":48.000064000000002},32.000104999999998,39.000127999999997,30.000176,42.000225,0,0,0,0,null,null,null,null,null,null,null,null,null,null,null,null,null,null,null,null,null,null,null,null,null,null,null,null,null,null,null,null,null,null,null,null,{"$f":"IF(DH$47>2,LARGE(DH$7:DH$46,3),0)","v":63.000031},{"$f":"IF(DI$47>2,LARGE(DI$7:DI$46,3),0)","v":44.000058000000003},33.000100000000003,48.000143000000001,46.000172999999997,31.000214,0,0,0,0,0,65.000005000000002,48.000064000000002,32.000104999999998,39.000127999999997,30.000176,42.000225,0,0,0,0]
[null,null,null,null,null,null,null,null,null,null,null,null,null,null,null,null,null,null,null,null,null,null,null,null,null,null,null,null,null,null,null,null,null,null,null,null,null,null,null,null,null,null,null,null,null,null,null,{"$f":"IF(AV$47>3,LARGE(AV$7:AV$46,4),0)","v":65.000011999999998},{"$f":"IF(AW$47>3,LARGE(AW$7:AW$46,4),0)","v":49.000064999999999},33.000100000000003,51.000124,40.000185000000002,40.000214999999997,0,0,0,0,null,{"$f":"IF(BG$47>3,LARGE(BG$7:BG$46,4),0)","v":62.000010000000003},{"$f":"IF(BH$47>3,LARGE(BH$7:BH$46,4),0)","v":41.000059999999998},32.000093,42.000140000000002,39.00018,28.000218,0,0,0,0,null,{"$f":"IF(BR$47>3,LARGE(BR$7:BR$46,4),0)","v":65.000004000000004},{"$f":"IF(BS$47>3,LARGE(BS$7:BS$46,4),0)","v":47.000073999999998},32.000104,33.000126999999999,30.000167000000001,36.000211999999998,0,0,0,0,null,null,null,null,null,null,null,null,null,null,null,null,null,null,null,null,null,null,null,null,null,null,null,null,null,null,null,null,null,null,null,null,{"$f":"IF(DH$47>3,LARGE(DH$7:DH$46,4),0)","v":62.000010000000003},{"$f":"IF(DI$47>3,LARGE(DI$7:DI$46,4),0)","v":41.000059999999998},32.000093,42.000140000000002,39.00018,28.000218,0,0,0,0,0,65.000004000000004,47.000073999999998,32.000104,33.000126999999999,30.000167000000001,36.000211999999998,0,0,0,0]
[null,null,null,null,null,null,null,null,null,null,null,null,null,null,null,null,null,null,null,null,null,null,null,null,null,null,null,null,null,null,null,null,null,null,null,null,null,null,null,null,null,null,null,null,null,null,null,{"$f":"IF(AV$47>4,LARGE(AV$7:AV$46,5),0)","v":65.000005000000002},{"$f":"IF(AW$47>4,LARGE(AW$7:AW$46,5),0)","v":48.000064000000002},33.000092000000002,48.000143000000001,39.00018,36.000213000000002,0,0,0,0,null,{"$f":"IF(BG$47>4,LARGE(BG$7:BG$46,5),0)","v":56.000013000000003},{"$f":"IF(BH$47>4,LARGE(BH$7:BH$46,5),0)","v":41.000041000000003},31.000098000000001,42.000121,39.000174000000001,0,0,0,0,0,null,{"$f":"IF(BR$47>4,LARGE(BR$7:BR$46,5),0)","v":64.000007999999994},{"$f":"IF(BS$47>4,LARGE(BS$7:BS$46,5),0)","v":46.000045},32.000087999999998,30.000154999999999,29.000185999999999,0,0,0,0,0,null,null,null,null,null,null,null,null,null,null,null,null,null,null,null,null,null,null,null,null,null,null,null,null,null,null,null,null,null,null,null,null,{"$f":"IF(DH$47>4,LARGE(DH$7:DH$46,5),0)","v":56.000013000000003},{"$f":"IF(DI$47>4,LARGE(DI$7:DI$46,5),0)","v":41.000041000000003},31.000098000000001,42.000121,39.000174000000001,0,0,0,0,0,0,64.000007999999994,46.000045,32.000087999999998,30.000154999999999,29.000185999999999,0,0,0,0,0]
[null,null,null,null,null,null,null,null,null,null,null,null,null,null,null,null,null,null,null,null,null,null,null,null,null,null,null,null,null,null,null,null,null,null,null,null,null,null,null,null,null,null,null,null,null,null,null,null,null,null,null,null,null,null,null,null,null,null,"Boys VC",null,null,null,null,null,null,null,null,null,null,"Girls VC"]
[null,null,null,null,null,null,null,null,null,null,null,null,null,null,null,null,null,null,null,null,null,null,null,null,null,null,null,null,null,null,null,null,null,null,null,null,null,null,null,null,null,null,null,null,null,null,null,null,null,null,null,null,null,null,null,null,null,null,{"$f":"IF(BQ47>0,LARGE(BG48:BP52,1)+LARGE(BG48:BP52,2)+LARGE(BG48:BP52,3)+LARGE(BG48:BP52,4)+LARGE(BG48:BP52,5)+LARGE(BG48:BP52,6)+LARGE(BG48:BP52,7)+LARGE(BG48:BP52,8)+LARGE(BG48:BP52,9)+LARGE(BG48:BP52,10)+LARGE(BG48:BP52,11)+LARGE(BG48:BP52,12)+LARGE(BG48:BP52,13)+LARGE(BG48:BP52,14)+LARGE(BG48:BP52,15)+LARGE(BG48:BP52,16)+LARGE(BG48:BP52,17)+LARGE(BG48:BP52,18)+LARGE(BG48:BP52,19)+LARGE(BG48:BP52,20)+LARGE(BG48:BP52,21)+LARGE(BG48:BP52,22)+LARGE(BG48:BP52,23)+LARGE(BG48:BP52,24)+LARGE(BG48:BP52,25),0)","v":1186.0026480000001},null,null,null,null,null,null,null,null,null,null,{"$f":"IF(CB47>0,LARGE(BR48:CA52,1)+LARGE(BR48:CA52,2)+LARGE(BR48:CA52,3)+LARGE(BR48:CA52,4)+LARGE(BR48:CA52,5)+LARGE(BR48:CA52,6)+LARGE(BR48:CA52,7)+LARGE(BR48:CA52,8)+LARGE(BR48:CA52,9)+LARGE(BR48:CA52,10)+LARGE(BR48:CA52,11)+LARGE(BR48:CA52,12)+LARGE(BR48:CA52,13)+LARGE(BR48:CA52,14)+LARGE(BR48:CA52,15)+LARGE(BR48:CA52,16)+LARGE(BR48:CA52,17)+LARGE(BR48:CA52,18)+LARGE(BR48:CA52,19)+LARGE(BR48:CA52,20)+LARGE(BR48:CA52,21)+LARGE(BR48:CA52,22)+LARGE(BR48:CA52,23)+LARGE(BR48:CA52,24)+LARGE(BR48:CA52,25),0)","v":1144.002622}]
[null,null,null,null,null,null,null,null,null,null,null,null,null,null,null,null,null,null,null,null,null,null,null,null,null,null,null,null,null,null,null,null,null,null,null,null,null,null,null,null,null,null,null,null,null,null,null,null,null,null,null,null,null,null,null,null,null,null,null,null,null,null,null,"MIXED"]
[null,null,null,null,null,null,null,null,null,null,null,null,null,null,null,null,null,null,null,null,null,null,null,null,null,null,null,null,null,null,null,null,null,null,null,null,null,null,null,null,null,null,null,null,null,null,null,null,null,null,null,null,null,null,null,null,null,null,null,null,null,null,null,{"$f":"BG54+BR54","v":2330.0052700000001}]

{"sheet":"Score Sheets","index":4,"n_rows":36,"n_cols":23,"rows_kept":36,"cut":false,"hidden":false,"merged":[[5,2,5,10],[5,11,5,14],[5,22,6,22],[5,23,6,23],[5,24,6,24],[5,25,6,25],[5,26,6,26],[5,27,6,27],[5,28,6,28],[5,29,6,29],[5,30,6,30],[5,31,6,31],[7,29,8,29],[7,30,8,30],[7,31,8,31],[5,32,6,32],[6,1,6,10],[6,11,6,14],[7,1,7,2],[7,3,7,16],[7,19,15,19],[7,22,8,22],[9,22,10,22],[9,23,10,23],[7,26,8,26],[7,27,8,27],[7,28,8,28],[7,23,8,23],[7,24,8,24],[7,25,8,25],[9,27,10,27],[9,29,10,29],[7,32,8,32],[8,1,8,2],[8,3,8,14],[9,1,10,2],[9,3,9,5],[9,6,9,8],[9,9,9,11],[9,30,10,30],[9,12,9,14],[9,31,10,31],[9,32,10,32],[10,3,10,5],[10,6,10,8],[10,9,10,11],[10,12,10,14],[9,24,10,24],[9,25,10,25],[9,26,10,26],[9,28,10,28],[11,28,12,28],[11,29,12,29],[11,1,12,2],[11,3,11,6],[11,7,11,10],[11,11,11,14],[11,22,12,22],[11,23,12,23],[11,30,12,30],[11,31,12,31],[11,32,12,32],[12,3,12,6],[12,7,12,10],[12,11,12,14],[11,24,12,24],[11,25,12,25],[11,26,12,26],[11,27,12,27],[13,9,13,10],[13,11,13,12],[14,3,14,4],[14,5,14,6],[14,7,14,8],[14,9,14,10],[14,11,14,12],[13,22,14,22],[13,23,14,23],[13,24,14,24],[13,25,14,25],[13,26,14,26],[14,13,14,14],[13,27,14,27],[13,28,14,28],[13,29,14,29],[13,30,14,30],[13,31,14,31],[13,32,14,32],[15,1,16,2],[15,3,15,5],[15,6,15,8],[15,9,15,11],[15,12,15,14],[13,1,14,2],[13,3,13,4],[13,5,13,6],[13,13,13,14],[13,7,13,8],[15,31,16,31],[15,32,16,32],[16,3,16,5],[16,6,16,8],[16,9,16,11],[16,12,16,14],[16,19,24,19],[15,22,16,22],[15,23,16,23],[15,24,16,24],[19,3,19,8],[19,9,19,14],[19,22,20,22],[15,28,16,28],[15,29,16,29],[15,30,16,30],[15,25,16,25],[15,26,16,26],[15,27,16,27],[17,26,18,26],[17,27,18,27],[17,28,18,28],[16,20,24,20],[17,1,18,2],[17,3,17,6],[17,7,17,10],[17,11,17,14],[17,22,18,22],[19,1,20,2],[18,3,18,6],[18,7,18,10],[18,11,18,14],[17,23,18,23],[17,24,18,24],[17,25,18,25],[19,27,20,27],[20,3,20,8],[20,9,20,14],[19,23,20,23],[19,24,20,24],[19,28,20,28],[17,29,18,29],[17,30,18,30],[17,31,18,31],[17,32,18,32],[19,29,20,29],[19,30,20,30],[19,31,20,31],[19,32,20,32],[19,25,20,25],[19,26,20,26],[21,28,22,28],[21,29,22,29],[21,1,22,2],[21,3,21,6],[21,7,21,10],[21,11,21,14],[21,22,22,22],[21,23,22,23],[21,30,22,30],[21,31,22,31],[21,32,22,32],[22,3,22,6],[22,7,22,10],[22,11,22,14],[21,24,22,24],[21,25,22,25],[21,26,22,26],[21,27,22,27],[23,28,24,28],[23,29,24,29],[23,1,24,2],[23,3,23,6],[23,7,23,10],[23,11,23,14],[23,22,24,22],[23,23,24,23],[23,30,24,30],[23,31,24,31],[23,32,24,32],[24,3,24,6],[24,7,24,10],[24,11,24,14],[23,24,24,24],[23,25,24,25],[23,26,24,26],[23,27,24,27],[25,1,26,2],[25,3,26,14],[25,22,27,22],[25,23,27,23],[25,24,27,24],[25,25,27,25],[25,26,27,26],[25,27,27,27],[25,28,27,28],[25,29,27,29],[25,30,27,30],[25,31,27,31],[28,29,30,29],[25,32,27,32],[27,1,28,2],[27,3,27,6],[27,7,27,10],[27,11,27,14],[28,3,28,6],[28,7,28,10],[28,11,28,14],[28,22,30,22],[30,11,30,14],[28,24,30,24],[28,25,30,25],[28,26,30,26],[28,27,30,27],[28,28,30,28],[28,23,30,23],[33,1,33,2],[28,30,30,30],[28,31,30,31],[28,32,30,32],[29,1,30,2],[29,3,29,6],[29,7,29,10],[29,11,29,14],[30,3,30,6],[30,7,30,10],[31,26,36,26],[31,27,36,27],[31,28,36,28],[31,29,36,29],[31,1,32,2],[31,3,31,6],[31,7,31,10],[31,11,31,14],[31,22,36,22],[31,23,36,23],[31,30,36,30],[31,31,36,31],[31,32,36,32],[32,3,32,6],[32,7,32,10],[32,11,32,14],[33,3,33,14],[35,1,37,16],[31,24,36,24],[31,25,36,25]]}
[]
[]
[]
[]
[]
[null,"NAME",null,null,null,null,null,null,null,null,null,"AGE",null,null,null,"GIRL",null,null,null,null,null,null,"STANDING TRIPLE JUMP"]
[null,null,null,null,null,null,null,null,null,null,null,null,null,null,null,"BOY"]
[null,"TEAM / SCHOOL",null,null,null,null,null,null,null,null,null,null,null,null,null,null,null,null,null,null,null,null,"JAVELIN / SHOT"]
[null,"EVENTS",null,"TRIALS",null,null,null,null,null,null,null,null,null,null,null,"PERFORMANCE","POINTS"]
[null,"BALANCE TEST",null,"LEFT",null,null,"RIGHT",null,null,"LEFT",null,null,"RIGHT",null,null,"TOTAL",null,null,null,null,null,null,"SHUTTLE RUN "]
[]
[null,"STANDING LONG JUMP",null,1,null,null,null,2,null,null,null,3,null,null,null,"BEST",null,null,null,null,null,null,"VERTICAL JUMP"]
[]
[null,"SPEED BOUNCE",null,10,null,20,null,30,null,40,null,50,null,60,null,"TOTAL",null,null,null,null,null,null,"CHEST PUSH"]
[]
[null,"TARGET THROW",null,"3m",null,null,"5m",null,null,"7m",null,null,"9m",null,null,"TOTAL",null,null,null,null,null,null,"HI-STEPPER"]
[null,null,null,null,null,null,null,null,null,null,null,null,null,null,null,null,null,null,null,"SPORTSHALL AWARDS","GROUP SHEET"]
[null,"OVERHEAD HEAVE",null,1,null,null,null,2,null,null,null,3,null,null,null,"BEST",null,null,null,null,null,null,"TARGET THROW / OVERHEAD HEAVE"]
[]
[null,"HI-STEPPER (4 X 8m shuttle run",null,"TIME TAKEN (secs)",null,null,null,null,null,"FAULTS",null,null,null,null,null,"ADJUSTED TIME",null,null,null,null,null,null,"SPEED BOUNCE"]
[]
[null,"CHEST PUSH",null,1,null,null,null,2,null,null,null,3,null,null,null,"BEST",null,null,null,null,null,null,"STANDING LONG JUMP"]
[]
[null,"VERTICAL JUMP",null,1,null,null,null,2,null,null,null,3,null,null,null,"BEST",null,null,null,null,null,null,"BALANCE TEST"]
[]
[null,"SHUTTLE RUN 10 x 10m",null,"TIME TRIAL",null,null,null,null,null,null,null,null,null,null,null,"SECONDS",null,null,null,null,null,null,"YEAR GROUP"]
[]
[null,"FOAM OR BULL NOSE JAVELIN",null,1,null,null,null,2,null,null,null,3,null,null,null,"BEST"]
[null,null,null,null,null,null,null,null,null,null,null,null,null,null,null,null,null,null,null,null,null,null,"GENDER"]
[null,"SHOT",null,1,null,null,null,2,null,null,null,3,null,null,null,"BEST"]
[]
[null,"STANDING TRIPLE JUMP",null,1,null,null,null,2,null,null,null,3,null,null,null,"BEST",null,null,null,null,null,null,"NAME"]
[]
[null,"SIGNED",null,null,null,null,null,null,null,null,null,null,null,null,null,"TOTAL POINTS"]
[]
[null,"Fully branded colour score cards with Jess Ennis and Philips Idowu pictures are available from www.eveque.co.uk/shop  "]

{"sheet":"Tables","index":5,"n_rows":93,"n_cols":25,"rows_kept":93,"cut":false,"hidden":false,"merged":[[1,8,3,12],[6,1,6,14],[7,0,8,0],[7,1,8,1],[7,2,8,2],[7,3,8,3],[7,4,8,4],[7,5,8,5],[7,6,8,6],[7,7,8,7],[7,14,8,14],[7,17,7,19],[7,24,7,28],[9,1,9,14],[7,8,8,8],[7,9,8,9],[7,10,8,10],[7,11,8,11],[7,12,8,12],[7,13,8,13]]}
[]
[null,null,null,null,null,null,null,null,"Tables"]
[]
[]
[]
[]
[null,"POINTS TABLE"]
[null,"Points","Balance Test (4 x 15 secs)","St. Long Jump","Speed Bounce (20 secs)","Target Throw","Overhead Heave","Hi-Stepper        (4 x 8m)","Chest Push (1kg)","Vertical Jump","Shuttle Run     (10 x 10m)","Foam or Bull Nosed Javelin","Shot","Standing Triple Jump","Points",null,null,"PRIMARY",null,null,null,null,null,null,"SECONDARY"]
[]
[null,"If your score goes off the table points will be awarded as follows:"]
[null,"increments","n/a","3cm","1 no. ","n/a","25cm","0.1 Sec","25cm","1cm","0.2 sec","1m","25cm","10cm","increments"]
[null,"Points","n/a",1,1,"n/a",2,2,2,1,1,2,1,1,"Points"]
[null,null,"secs","mtrs","No.","No.","mtrs","secs","mtrs","cms","secs","mtrs","mtrs","mtrs"]
[null,80,"-",2.8,80,"-",12,11,11.75,68,24,"-",12,8,80]
[null,79,"-",2.75,79,"-","-",11.2,"-",67,24.2,28,11.75,7.87,79]
[null,78,"-",2.7,78,"-",11.75,11.4,11.5,66,24.4,"-",11.5,7.75,78]
[null,77,"-",2.65,77,"-","-",11.6,"-",65,24.6,27,11.25,7.67,77]
[null,76,"-",2.6,76,"-",11.5,11.8,11.25,64,24.8,"-",11,7.5,76]
[null,75,"-",2.5499999999999998,75,"-","-",12,"-",63,25,26,10.75,7.37,75]
[null,74,"-",2.52,74,"-",11.25,12.2,11,62,25.2,"-",10.5,7.25,74]
[null,73,"-",2.4900000000000002,73,"-","-",12.4,"-",61,25.4,25,10.25,7.12,73]
[null,72,"-",2.46,72,24,11,12.5,10.75,"-",25.6,"-",10,7.05,72]
[null,71,"-",2.4300000000000002,71,"-","-",12.6,"-",60,25.8,24,9.75,6.95,71]
[null,70,"-",2.4,70,"-",10.75,12.7,10.5,59,26,"-",9.5,6.85,70]
[null,69,"-",2.37,69,23,"-",12.8,"-","-",26.2,23,9.25,6.75,69]
[null,68,"-",2.34,68,"-",10.5,12.9,10.25,58,26.4,"-",9,6.65,68]
[null,67,"-",2.31,67,"-","-",13,"-",57,26.6,"-",8.75,6.55,67]
[null,66,"-",2.2799999999999998,66,22,10.25,13.1,10,"-",26.8,22,8.5,6.45,66]
[null,65,60,2.25,65,"-","-",13.2,9.75,56,27,"-",8.25,6.36,65]
[null,64,59,2.2200000000000002,64,"-",10,13.3,9.5,55,27.2,"-",8,6.28,64]
[null,63,58,2.19,63,21,9.75,13.4,"-","-",27.4,21,7.75,6.2,63]
[null,62,57,2.16,62,"-","-",13.5,9.25,54,27.6,"-",7.5,6.12,62]
[null,61,56,2.13,61,"-",9.5,13.6,"-",53,27.8,"-",7.25,6.04,61]
[null,60,55,2.1,60,20,9.25,13.7,9,"-",28,20,7,5.96,60]
[null,59,54,2.0699999999999998,59,"-","-",13.8,"-",52,28.2,"-",6.75,5.88,59]
[null,58,53,2.04,58,"-",9,13.9,8.75,51,28.4,"-",6.5,5.8,58]
[null,57,52,2.0099999999999998,57,19,8.75,14,8.5,"-",28.6,19,6.25,5.72,57]
[null,56,51,1.98,56,"-","-",14.1,8.25,50,28.8,"-",6,5.64,56]
[null,55,50,1.95,55,"-",8.5,14.2,8,49,29,"-","-",5.56,55]
[null,54,49,1.92,54,18,8.25,14.3,"-",48,29.2,18,5.75,5.48,54]
[null,53,48,1.89,53,"-",8,14.4,7.75,47,29.4,"-","-",5.4,53]
[null,52,47,1.86,52,"-",7.75,14.5,7.5,46,29.6,"-",5.5,5.34,52]
[null,51,46,1.83,51,17,"-",14.6,"-",45,29.8,17,"-",5.28,51]
[null,50,45,1.8,50,"-",7.5,14.7,7.25,44,30,"-",5.25,5.22,50]
[null,49,44,1.78,49,"-",7.25,14.8,7,43,30.2,"-","-",5.16,49]
[null,48,43,1.76,"-",16,"-",14.9,"-",42,30.4,16,5,5.0999999999999996,48]
[null,47,42,1.74,48,"-",7,15,6.75,41,30.6,"-","-",5.04,47]
[null,46,41,1.72,"-","-",6.75,15.1,6.5,40,30.8,"-",4.75,4.9800000000000004,46]
[null,45,"-",1.7,47,15,"-",15.2,"-","-",31,15,"-",4.92,45]
[null,44,40,1.68,46,"-",6.5,15.3,6.25,39,31.2,"-",4.5,4.8600000000000003,44]
[null,43,"-",1.66,45,"-","-",15.4,"-",38,31.4,"-","-",4.8,43]
[null,42,39,1.64,44,14,6.25,15.5,6,"-",31.6,14,4.25,4.75,42]
[null,41,"-",1.62,43,"-","-",15.6,"-",37,31.8,"-","-",4.7,41]
[null,40,38,1.6,42,"-",6,15.7,5.75,36,32,"-",4,4.6500000000000004,40]
[null,39,"-",1.59,41,13,"-",15.8,"-","-",32.200000000000003,13,"-",4.5999999999999996,39]
[null,38,37,1.58,40,"-",5.75,15.9,5.5,35,32.4,"-","-",4.55,38]
[null,37,"-",1.57,39,"-","-",16,"-",34,32.6,"-",3.75,4.5,37]
[null,36,36,1.56,38,12,5.5,16.100000000000001,5.25,"-",32.799999999999997,12,"-",4.45,36]
[null,35,35,1.55,37,"-","-",16.2,"-",33,33,"-","-",4.4000000000000004,35]
[null,34,34,1.54,36,"-","-",16.3,"-",32,33.200000000000003,"-","-",4.3499999999999996,34]
[null,33,33,1.53,35,11,5.25,16.399999999999999,5,"-",33.4,11,"-",4.3,33]
[null,32,32,1.52,34,"-","-",16.5,"-",31,33.6,"-",3.5,4.25,32]
[null,31,31,1.51,33,"-",5,16.600000000000001,4.75,30,33.799999999999997,"-","-",4.2,31]
[null,30,30,1.5,32,10,"-",16.8,"-",29,34,10,"-",4.1500000000000004,30]
[null,29,29,1.48,31,"-",4.75,17,"-","-",34.200000000000003,"-","-",4.0999999999999996,29]
[null,28,28,1.46,30,"-","-",17.2,4.5,28,34.4,"-","-",4.05,28]
[null,27,27,1.44,29,9,4.5,17.399999999999999,"-",27,34.6,9,3.25,4,27]
[null,26,26,1.42,28,"-","-",17.600000000000001,"-",26,34.799999999999997,"-","-",3.95,26]
[null,25,25,1.4,27,"-",4.25,18,4.25,"-",35,"-","-",3.9,25]
[null,24,24,1.38,26,8,"-",18.3,"-",25,35.5,8,"-",3.8,24]
[null,23,23,1.36,"-","-","-",18.600000000000001,"-",24,36,"-","-",3.7,23]
[null,22,22,1.34,25,"-",4,18.899999999999999,4,23,36.5,"-",3,3.6,22]
[null,21,21,1.32,24,7,"-",19.2,"-","-",37,"-","-",3.5,21]
[null,20,20,1.3,23,"-","-",19.600000000000001,"-",22,37.5,7,"-",3.4,20]
[null,19,19,1.25,22,"-",3.75,20,3.75,"-",38,"-","-",3.3,19]
[null,18,18,1.2,"-",6,"-",20.5,"-",21,38.5,"-","-",3.2,18]
[null,17,17,1.1499999999999999,21,"-","-",21,"-","-",39,"-",2.75,3.1,17]
[null,16,16,1.1000000000000001,20,"-",3.5,21.5,3.5,20,39.5,6,"-",3,16]
[null,15,15,1.05,19,5,"-",22,"-",19,40,"-","-",2.9,15]
[null,14,14,1,18,"-","-",22.5,"-",18,40.5,"-","-",2.8,14]
[null,13,13,0.95,17,"-",3.25,23,3.25,17,41,"-","-",2.7,13]
[null,12,12,0.9,16,4,"-",24,"-",16,42,5,2.5,2.6,12]
[null,11,11,0.85,15,"-","-",25,"-",15,43,"-","-",2.5,11]
[null,10,10,0.8,14,"-",3,26,3,14,44,"-",2.25,2.4,10]
[null,9,9,0.75,13,3,"-",27,"-",13,45,"-","-",2.2000000000000002,9]
[null,8,8,0.7,12,"-",2.75,28,2.75,12,46,4,2,2,8]
[null,7,7,0.65,11,"-","-",29,"-",11,48,"-","-",1.9,7]
[null,6,6,0.6,10,2,2.5,30,2.5,10,50,"-",1.5,1.8,6]
[null,5,5,0.55000000000000004,9,"-","-",32,"-",9,52,"-","-",1.7,5]
[null,4,4,0.5,8,"-",2,34,2,8,54,3,1,1.5,4]
[null,3,3,0.45,6,1,"-",36,"-",7,56,"-","-",1.3,3]
[null,2,2,0.4,4,"-","-",38,"-",6,58,"-",0.5,1.1000000000000001,2]
[null,1,1,0.35,3,"-",1.5,40,1.5,4,60,2,"-",1,1]